{"text_format":"1","workbook":"xlsx","n_sheets":5,"sheets":["BASE ALUMNOS","FLOTA","Hoja1","Hoja3","Hoja2"],"not_rendered":{"charts":0,"images":0,"macros":1,"external_links":0,"defined_names":7,"comments":0,"pivot_tables":0},"unopened":[],"bounds":{"document_bytes":16777216,"sheet_cells":100000,"rows_first":2000,"rows_last":500,"rows_between":2000,"halvings":0,"cell_chars":16384,"cell_head_chars":4096},"cells_cut":0,"cells_raw":0,"read":"whole","date_system":"1900"}

{"sheet":"BASE ALUMNOS","index":0,"n_rows":1003,"n_cols":23,"rows_kept":1003,"cut":false,"hidden":false,"merged":[]}
["registro","fecha","nombre","Telefono","dni","fecnac","curso","licposee","licasp","FEC INI-CURSO","entrega certif","COD INST","instructor","vehiculo","vehiculo","horario de clase",null,null,null,"resultado","fechacert","nota","INSTRUCTOR"]
[1,"2014-12-02","QUISPE AÑAMURO, VIDAL",null,29602036,null,"Profesionalización","-","AIII-c","2014-12-02",{"$f":"+J2+59","v":"2015-01-30"},16,{"$f":"IF(L2=\"\",\" \",LOOKUP(L2,FLOTA!A:A,FLOTA!B:B))","v":"CARLOS JAVIER RODOLFO MORRIBERON ROSAS"},{"$f":"IF(L2=\"\",\"\",L2)","v":16},{"$f":"IF(N2=\"\",\" \",LOOKUP(N2,FLOTA!A:A,FLOTA!H:H))","v":"B8V-870"},0,null,null,null,"ARCHIVADO","2015-04-17",17]
[2,"2014-12-02","ODAR GUTIERREZ, RUDY VICTOR",null,44018440,null,"Profesionalización","-","AIII-c","2014-12-02",{"$f":"+J3+59","v":"2015-01-30"},16,{"$f":"IF(L3=\"\",\" \",LOOKUP(L3,FLOTA!A:A,FLOTA!B:B))","v":"CARLOS JAVIER RODOLFO MORRIBERON ROSAS"},16,{"$f":"IF(N3=\"\",\" \",LOOKUP(N3,FLOTA!A:A,FLOTA!H:H))","v":"B8V-870"},0,null,null,null,"ARCHIVADO","2015-02-06",17]
[3,"2014-12-04","MAMANI PINTO, ALAN GIMMY",null,43518580,null,"Profesionalización","-","AII-b","2014-12-04","2015-01-01",8,{"$f":"IF(L4=\"\",\" \",LOOKUP(L4,FLOTA!A:A,FLOTA!B:B))","v":"EZEQUIEL HERMILIO AVALOS BRAVO"},8,{"$f":"IF(N4=\"\",\" \",LOOKUP(N4,FLOTA!A:A,FLOTA!H:H))","v":"X1A-960"},null,null,null,null,"ARCHIVADO","2014-12-03"]
[4,"2014-12-04","PUMA VELASQUEZ, ROCIO PILAR",null,43861345,null,"Profesionalización","-","AIII-c","2014-12-04",{"$f":"+J5+59","v":"2015-02-01"},17,{"$f":"IF(L5=\"\",\" \",LOOKUP(L5,FLOTA!A:A,FLOTA!B:B))","v":"JOAQUIN TICONA "},17,{"$f":"IF(N5=\"\",\" \",LOOKUP(N5,FLOTA!A:A,FLOTA!H:H))","v":"V4C-942"},0,null,null,null,"."]
[5,"2014-12-06","AYLLON CHARCA, WILLY GERMAN",null,46472299,null,"Profesionalización","-","AII-b","2014-12-06","2015-01-03",8,{"$f":"IF(L6=\"\",\" \",LOOKUP(L6,FLOTA!A:A,FLOTA!B:B))","v":"EZEQUIEL HERMILIO AVALOS BRAVO"},8,{"$f":"IF(N6=\"\",\" \",LOOKUP(N6,FLOTA!A:A,FLOTA!H:H))","v":"X1A-960"},null,null,null,null,"ARCHIVADO","2015-01-06"]
[6,"2014-12-10","APAZA QUISPE, GRIMALDO HOLGER",null,47588638,null,"Profesionalización","-","AIII-c","2014-12-10",{"$f":"+J7+59","v":"2015-02-07"},17,{"$f":"IF(L7=\"\",\" \",LOOKUP(L7,FLOTA!A:A,FLOTA!B:B))","v":"JOAQUIN TICONA "},17,{"$f":"IF(N7=\"\",\" \",LOOKUP(N7,FLOTA!A:A,FLOTA!H:H))","v":"V4C-942"},0,null,null,null,"."]
[7,"2014-12-11","MAMANI GARCIA, JESUS ANGEL",null,47538656,null,"Profesionalización","-","AII-b","2014-12-11","2015-01-08",8,{"$f":"IF(L8=\"\",\" \",LOOKUP(L8,FLOTA!A:A,FLOTA!B:B))","v":"EZEQUIEL HERMILIO AVALOS BRAVO"},8,{"$f":"IF(N8=\"\",\" \",LOOKUP(N8,FLOTA!A:A,FLOTA!H:H))","v":"X1A-960"},null,null,null,null,"ARCHIVADO","2015-01-08"]
[8,"2014-12-12","SANCA ZELA, VICTOR CAYETANO",null,47811619,null,"Profesionalización","-","AII-b","2014-12-12","2015-01-09",8,{"$f":"IF(L9=\"\",\" \",LOOKUP(L9,FLOTA!A:A,FLOTA!B:B))","v":"EZEQUIEL HERMILIO AVALOS BRAVO"},8,{"$f":"IF(N9=\"\",\" \",LOOKUP(N9,FLOTA!A:A,FLOTA!H:H))","v":"X1A-960"},null,null,null,null,"ARCHIVADO","2015-01-13"]
[9,"2014-12-13","GUERREROS QUISPE, CARLOS EDWIN",null,46082488,null,"Profesionalización","-","AII-b","2014-12-13","2015-01-10",8,{"$f":"IF(L10=\"\",\" \",LOOKUP(L10,FLOTA!A:A,FLOTA!B:B))","v":"EZEQUIEL HERMILIO AVALOS BRAVO"},8,{"$f":"IF(N10=\"\",\" \",LOOKUP(N10,FLOTA!A:A,FLOTA!H:H))","v":"X1A-960"},null,null,null,null,"."]
[10,"2014-12-15","QUISPE VALENZUELA, CARLOS JONATHAN",null,48043909,null,"Profesionalización","-","AII-b","2014-12-15","2015-01-12",8,{"$f":"IF(L11=\"\",\" \",LOOKUP(L11,FLOTA!A:A,FLOTA!B:B))","v":"EZEQUIEL HERMILIO AVALOS BRAVO"},8,{"$f":"IF(N11=\"\",\" \",LOOKUP(N11,FLOTA!A:A,FLOTA!H:H))","v":"X1A-960"},null,null,null,null,"ARCHIVADO","2015-01-15"]
[null,null,null,null,null,null,null,null,null,null,null,null,{"$f":"IF(L12=\"\",\" \",LOOKUP(L12,FLOTA!A:A,FLOTA!B:B))","v":" "},{"$f":"IF(L12=\"\",\"\",L12)","v":""},{"$f":"IF(N12=\"\",\" \",LOOKUP(N12,FLOTA!A:A,FLOTA!H:H))","v":" "},null,null,null,null,"."]
[null,null,null,null,null,null,null,null,null,null,null,null,{"$f":"IF(L13=\"\",\" \",LOOKUP(L13,FLOTA!A:A,FLOTA!B:B))","v":" "},"",{"$f":"IF(N13=\"\",\" \",LOOKUP(N13,FLOTA!A:A,FLOTA!H:H))","v":" "},null,null,null,null,"."]
[null,null,null,null,null,null,null,null,null,null,null,null,{"$f":"IF(L14=\"\",\" \",LOOKUP(L14,FLOTA!A:A,FLOTA!B:B))","v":" "},"",{"$f":"IF(N14=\"\",\" \",LOOKUP(N14,FLOTA!A:A,FLOTA!H:H))","v":" "},null,null,null,null,"."]
[null,null,null,null,null,null,null,null,null,null,null,null,{"$f":"IF(L15=\"\",\" \",LOOKUP(L15,FLOTA!A:A,FLOTA!B:B))","v":" "},"",{"$f":"IF(N15=\"\",\" \",LOOKUP(N15,FLOTA!A:A,FLOTA!H:H))","v":" "},null,null,null,null,"."]
[null,null,null,null,null,null,null,null,null,null,null,null,{"$f":"IF(L16=\"\",\" \",LOOKUP(L16,FLOTA!A:A,FLOTA!B:B))","v":" "},"",{"$f":"IF(N16=\"\",\" \",LOOKUP(N16,FLOTA!A:A,FLOTA!H:H))","v":" "},null,null,null,null,"."]
[null,null,null,null,null,null,null,null,null,null,null,null,{"$f":"IF(L17=\"\",\" \",LOOKUP(L17,FLOTA!A:A,FLOTA!B:B))","v":" "},"",{"$f":"IF(N17=\"\",\" \",LOOKUP(N17,FLOTA!A:A,FLOTA!H:H))","v":" "},null,null,null,null,"."]
[null,null,null,null,null,null,null,null,null,null,null,null,{"$f":"IF(L18=\"\",\" \",LOOKUP(L18,FLOTA!A:A,FLOTA!B:B))","v":" "},"",{"$f":"IF(N18=\"\",\" \",LOOKUP(N18,FLOTA!A:A,FLOTA!H:H))","v":" "},null,null,null,null,"."]
[null,null,null,null,null,null,null,null,null,null,null,null,{"$f":"IF(L19=\"\",\" \",LOOKUP(L19,FLOTA!A:A,FLOTA!B:B))","v":" "},"",{"$f":"IF(N19=\"\",\" \",LOOKUP(N19,FLOTA!A:A,FLOTA!H:H))","v":" "},null,null,null,null,"."]
[null,null,null,null,null,null,null,null,null,null,null,null,{"$f":"IF(L20=\"\",\" \",LOOKUP(L20,FLOTA!A:A,FLOTA!B:B))","v":" "},"",{"$f":"IF(N20=\"\",\" \",LOOKUP(N20,FLOTA!A:A,FLOTA!H:H))","v":" "},null,null,null,null,"."]
[null,null,null,null,null,null,null,null,null,null,null,null,{"$f":"IF(L21=\"\",\" \",LOOKUP(L21,FLOTA!A:A,FLOTA!B:B))","v":" "},"",{"$f":"IF(N21=\"\",\" \",LOOKUP(N21,FLOTA!A:A,FLOTA!H:H))","v":" "},null,null,null,null,"."]
[null,null,null,null,null,null,null,null,null,null,null,null,{"$f":"IF(L22=\"\",\" \",LOOKUP(L22,FLOTA!A:A,FLOTA!B:B))","v":" "},"",{"$f":"IF(N22=\"\",\" \",LOOKUP(N22,FLOTA!A:A,FLOTA!H:H))","v":" "},null,null,null,null,"."]
[null,null,null,null,null,null,null,null,null,null,null,null,{"$f":"IF(L23=\"\",\" \",LOOKUP(L23,FLOTA!A:A,FLOTA!B:B))","v":" "},"",{"$f":"IF(N23=\"\",\" \",LOOKUP(N23,FLOTA!A:A,FLOTA!H:H))","v":" "},null,null,null,null,"."]
[null,null,null,null,null,null,null,null,null,null,null,null,{"$f":"IF(L24=\"\",\" \",LOOKUP(L24,FLOTA!A:A,FLOTA!B:B))","v":" "},"",{"$f":"IF(N24=\"\",\" \",LOOKUP(N24,FLOTA!A:A,FLOTA!H:H))","v":" "},null,null,null,null,"."]
[null,null,null,null,null,null,null,null,null,null,null,null,{"$f":"IF(L25=\"\",\" \",LOOKUP(L25,FLOTA!A:A,FLOTA!B:B))","v":" "},"",{"$f":"IF(N25=\"\",\" \",LOOKUP(N25,FLOTA!A:A,FLOTA!H:H))","v":" "},null,null,null,null,"."]
[null,null,null,null,null,null,null,null,null,null,null,null,{"$f":"IF(L26=\"\",\" \",LOOKUP(L26,FLOTA!A:A,FLOTA!B:B))","v":" "},"",{"$f":"IF(N26=\"\",\" \",LOOKUP(N26,FLOTA!A:A,FLOTA!H:H))","v":" "},null,null,null,null,"."]
[null,null,null,null,null,null,null,null,null,null,null,null,{"$f":"IF(L27=\"\",\" \",LOOKUP(L27,FLOTA!A:A,FLOTA!B:B))","v":" "},"",{"$f":"IF(N27=\"\",\" \",LOOKUP(N27,FLOTA!A:A,FLOTA!H:H))","v":" "},null,null,null,null,"."]
[null,null,null,null,null,null,null,null,null,null,null,null,{"$f":"IF(L28=\"\",\" \",LOOKUP(L28,FLOTA!A:A,FLOTA!B:B))","v":" "},"",{"$f":"IF(N28=\"\",\" \",LOOKUP(N28,FLOTA!A:A,FLOTA!H:H))","v":" "},null,null,null,null,"."]
[null,null,null,null,null,null,null,null,null,null,null,null,{"$f":"IF(L29=\"\",\" \",LOOKUP(L29,FLOTA!A:A,FLOTA!B:B))","v":" "},"",{"$f":"IF(N29=\"\",\" \",LOOKUP(N29,FLOTA!A:A,FLOTA!H:H))","v":" "},null,null,null,null,"."]
[null,null,null,null,null,null,null,null,null,null,null,null,{"$f":"IF(L30=\"\",\" \",LOOKUP(L30,FLOTA!A:A,FLOTA!B:B))","v":" "},"",{"$f":"IF(N30=\"\",\" \",LOOKUP(N30,FLOTA!A:A,FLOTA!H:H))","v":" "},null,null,null,null,"."]
[null,null,null,null,null,null,null,null,null,null,null,null,{"$f":"IF(L31=\"\",\" \",LOOKUP(L31,FLOTA!A:A,FLOTA!B:B))","v":" "},"",{"$f":"IF(N31=\"\",\" \",LOOKUP(N31,FLOTA!A:A,FLOTA!H:H))","v":" "},null,null,null,null,"."]
[null,null,null,null,null,null,null,null,null,null,null,null,{"$f":"IF(L32=\"\",\" \",LOOKUP(L32,FLOTA!A:A,FLOTA!B:B))","v":" "},"",{"$f":"IF(N32=\"\",\" \",LOOKUP(N32,FLOTA!A:A,FLOTA!H:H))","v":" "},null,null,null,null,"."]
[null,null,null,null,null,null,null,null,null,null,null,null,{"$f":"IF(L33=\"\",\" \",LOOKUP(L33,FLOTA!A:A,FLOTA!B:B))","v":" "},"",{"$f":"IF(N33=\"\",\" \",LOOKUP(N33,FLOTA!A:A,FLOTA!H:H))","v":" "},null,null,null,null,"."]
[null,null,null,null,null,null,null,null,null,null,null,null,{"$f":"IF(L34=\"\",\" \",LOOKUP(L34,FLOTA!A:A,FLOTA!B:B))","v":" "},"",{"$f":"IF(N34=\"\",\" \",LOOKUP(N34,FLOTA!A:A,FLOTA!H:H))","v":" "},null,null,null,null,"."]
[null,null,null,null,null,null,null,null,null,null,null,null,{"$f":"IF(L35=\"\",\" \",LOOKUP(L35,FLOTA!A:A,FLOTA!B:B))","v":" "},"",{"$f":"IF(N35=\"\",\" \",LOOKUP(N35,FLOTA!A:A,FLOTA!H:H))","v":" "},null,null,null,null,"."]
[null,null,null,null,null,null,null,null,null,null,null,null,{"$f":"IF(L36=\"\",\" \",LOOKUP(L36,FLOTA!A:A,FLOTA!B:B))","v":" "},"",{"$f":"IF(N36=\"\",\" \",LOOKUP(N36,FLOTA!A:A,FLOTA!H:H))","v":" "},null,null,null,null,"."]
[null,null,null,null,null,null,null,null,null,null,null,null,{"$f":"IF(L37=\"\",\" \",LOOKUP(L37,FLOTA!A:A,FLOTA!B:B))","v":" "},"",{"$f":"IF(N37=\"\",\" \",LOOKUP(N37,FLOTA!A:A,FLOTA!H:H))","v":" "},null,null,null,null,"."]
[null,null,null,null,null,null,null,null,null,null,null,null,{"$f":"IF(L38=\"\",\" \",LOOKUP(L38,FLOTA!A:A,FLOTA!B:B))","v":" "},"",{"$f":"IF(N38=\"\",\" \",LOOKUP(N38,FLOTA!A:A,FLOTA!H:H))","v":" "},null,null,null,null,"."]
[null,null,null,null,null,null,null,null,null,null,null,null,{"$f":"IF(L39=\"\",\" \",LOOKUP(L39,FLOTA!A:A,FLOTA!B:B))","v":" "},"",{"$f":"IF(N39=\"\",\" \",LOOKUP(N39,FLOTA!A:A,FLOTA!H:H))","v":" "},null,null,null,null,"."]
[null,null,null,null,null,null,null,null,null,null,null,null,{"$f":"IF(L40=\"\",\" \",LOOKUP(L40,FLOTA!A:A,FLOTA!B:B))","v":" "},"",{"$f":"IF(N40=\"\",\" \",LOOKUP(N40,FLOTA!A:A,FLOTA!H:H))","v":" "},null,null,null,null,"."]
[null,null,null,null,null,null,null,null,null,null,null,null,{"$f":"IF(L41=\"\",\" \",LOOKUP(L41,FLOTA!A:A,FLOTA!B:B))","v":" "},"",{"$f":"IF(N41=\"\",\" \",LOOKUP(N41,FLOTA!A:A,FLOTA!H:H))","v":" "},null,null,null,null,"."]
[null,null,null,null,null,null,null,null,null,null,null,null,{"$f":"IF(L42=\"\",\" \",LOOKUP(L42,FLOTA!A:A,FLOTA!B:B))","v":" "},"",{"$f":"IF(N42=\"\",\" \",LOOKUP(N42,FLOTA!A:A,FLOTA!H:H))","v":" "},null,null,null,null,"."]
[null,null,null,null,null,null,null,null,null,null,null,null,{"$f":"IF(L43=\"\",\" \",LOOKUP(L43,FLOTA!A:A,FLOTA!B:B))","v":" "},"",{"$f":"IF(N43=\"\",\" \",LOOKUP(N43,FLOTA!A:A,FLOTA!H:H))","v":" "},null,null,null,null,"."]
[null,null,null,null,null,null,null,null,null,null,null,null,{"$f":"IF(L44=\"\",\" \",LOOKUP(L44,FLOTA!A:A,FLOTA!B:B))","v":" "},"",{"$f":"IF(N44=\"\",\" \",LOOKUP(N44,FLOTA!A:A,FLOTA!H:H))","v":" "},null,null,null,null,"."]
[null,null,null,null,null,null,null,null,null,null,null,null,{"$f":"IF(L45=\"\",\" \",LOOKUP(L45,FLOTA!A:A,FLOTA!B:B))","v":" "},"",{"$f":"IF(N45=\"\",\" \",LOOKUP(N45,FLOTA!A:A,FLOTA!H:H))","v":" "},null,null,null,null,"."]
[null,null,null,null,null,null,null,null,null,null,null,null,{"$f":"IF(L46=\"\",\" \",LOOKUP(L46,FLOTA!A:A,FLOTA!B:B))","v":" "},"",{"$f":"IF(N46=\"\",\" \",LOOKUP(N46,FLOTA!A:A,FLOTA!H:H))","v":" "},null,null,null,null,"."]
[null,null,null,null,null,null,null,null,null,null,null,null,{"$f":"IF(L47=\"\",\" \",LOOKUP(L47,FLOTA!A:A,FLOTA!B:B))","v":" "},"",{"$f":"IF(N47=\"\",\" \",LOOKUP(N47,FLOTA!A:A,FLOTA!H:H))","v":" "},null,null,null,null,"."]
[null,null,null,null,null,null,null,null,null,null,null,null,{"$f":"IF(L48=\"\",\" \",LOOKUP(L48,FLOTA!A:A,FLOTA!B:B))","v":" "},"",{"$f":"IF(N48=\"\",\" \",LOOKUP(N48,FLOTA!A:A,FLOTA!H:H))","v":" "},null,null,null,null,"."]
[null,null,null,null,null,null,null,null,null,null,null,null,{"$f":"IF(L49=\"\",\" \",LOOKUP(L49,FLOTA!A:A,FLOTA!B:B))","v":" "},"",{"$f":"IF(N49=\"\",\" \",LOOKUP(N49,FLOTA!A:A,FLOTA!H:H))","v":" "},null,null,null,null,"."]
[null,null,null,null,null,null,null,null,null,null,null,null,{"$f":"IF(L50=\"\",\" \",LOOKUP(L50,FLOTA!A:A,FLOTA!B:B))","v":" "},"",{"$f":"IF(N50=\"\",\" \",LOOKUP(N50,FLOTA!A:A,FLOTA!H:H))","v":" "},null,null,null,null,"."]
[null,null,null,null,null,null,null,null,null,null,null,null,{"$f":"IF(L51=\"\",\" \",LOOKUP(L51,FLOTA!A:A,FLOTA!B:B))","v":" "},"",{"$f":"IF(N51=\"\",\" \",LOOKUP(N51,FLOTA!A:A,FLOTA!H:H))","v":" "},null,null,null,null,"."]
[null,null,null,null,null,null,null,null,null,null,null,null,{"$f":"IF(L52=\"\",\" \",LOOKUP(L52,FLOTA!A:A,FLOTA!B:B))","v":" "},"",{"$f":"IF(N52=\"\",\" \",LOOKUP(N52,FLOTA!A:A,FLOTA!H:H))","v":" "},null,null,null,null,"."]
[null,null,null,null,null,null,null,null,null,null,null,null,{"$f":"IF(L53=\"\",\" \",LOOKUP(L53,FLOTA!A:A,FLOTA!B:B))","v":" "},"",{"$f":"IF(N53=\"\",\" \",LOOKUP(N53,FLOTA!A:A,FLOTA!H:H))","v":" "},null,null,null,null,"."]
[null,null,null,null,null,null,null,null,null,null,null,null,{"$f":"IF(L54=\"\",\" \",LOOKUP(L54,FLOTA!A:A,FLOTA!B:B))","v":" "},"",{"$f":"IF(N54=\"\",\" \",LOOKUP(N54,FLOTA!A:A,FLOTA!H:H))","v":" "},null,null,null,null,"."]
[null,null,null,null,null,null,null,null,null,null,null,null,{"$f":"IF(L55=\"\",\" \",LOOKUP(L55,FLOTA!A:A,FLOTA!B:B))","v":" "},"",{"$f":"IF(N55=\"\",\" \",LOOKUP(N55,FLOTA!A:A,FLOTA!H:H))","v":" "},null,null,null,null,"."]
[null,null,null,null,null,null,null,null,null,null,null,null,{"$f":"IF(L56=\"\",\" \",LOOKUP(L56,FLOTA!A:A,FLOTA!B:B))","v":" "},"",{"$f":"IF(N56=\"\",\" \",LOOKUP(N56,FLOTA!A:A,FLOTA!H:H))","v":" "},null,null,null,null,"."]
[null,null,null,null,null,null,null,null,null,null,null,null,{"$f":"IF(L57=\"\",\" \",LOOKUP(L57,FLOTA!A:A,FLOTA!B:B))","v":" "},"",{"$f":"IF(N57=\"\",\" \",LOOKUP(N57,FLOTA!A:A,FLOTA!H:H))","v":" "},null,null,null,null,"."]
[null,null,null,null,null,null,null,null,null,null,null,null,{"$f":"IF(L58=\"\",\" \",LOOKUP(L58,FLOTA!A:A,FLOTA!B:B))","v":" "},"",{"$f":"IF(N58=\"\",\" \",LOOKUP(N58,FLOTA!A:A,FLOTA!H:H))","v":" "},null,null,null,null,"."]
[null,null,null,null,null,null,null,null,null,null,null,null,{"$f":"IF(L59=\"\",\" \",LOOKUP(L59,FLOTA!A:A,FLOTA!B:B))","v":" "},"",{"$f":"IF(N59=\"\",\" \",LOOKUP(N59,FLOTA!A:A,FLOTA!H:H))","v":" "},null,null,null,null,"."]
[null,null,null,null,null,null,null,null,null,null,null,null,{"$f":"IF(L60=\"\",\" \",LOOKUP(L60,FLOTA!A:A,FLOTA!B:B))","v":" "},"",{"$f":"IF(N60=\"\",\" \",LOOKUP(N60,FLOTA!A:A,FLOTA!H:H))","v":" "},null,null,null,null,"."]
{"$rows_left_out":944}
{"sheet":"FLOTA","index":1,"n_rows":20,"n_cols":166,"rows_kept":20,"cut":false,"hidden":false,"merged":[]}
["CODIGO","INSTRUCTOR","CATEGORIA",null,"MARCA","MODELO","CLASE","PLACA","Km INICIALREAL","Km INICIAL","Km al 1/2/2013","RECORRIDO","EXESO","2013-02-14","2013-02-27","2013-04-11","2015-01-15","2015-12-28","2014-12-29","2014-12-30","2014-12-31","2015-01-01","2015-01-02","2015-01-03","2015-01-04","2015-01-05","2015-01-06","2015-01-07","2015-01-08","2015-01-09","2015-01-10","2015-01-11","2015-01-12","2015-01-13","2015-01-14","2015-01-15","2015-01-16","2015-01-17","2015-01-18","2015-01-19","2015-01-20","2015-01-21","2015-01-22","2015-01-23","2015-01-24","2015-01-25","2015-01-26","2015-01-27","2015-01-28","2015-01-29","2015-01-30","2015-01-31","2015-02-01","2015-02-02","2015-02-03","2015-02-04","2015-02-05","2015-02-06","2015-02-07","2015-02-08","2015-02-09","2015-02-10","2015-02-11","2015-02-12","2015-02-13","2015-02-14","2015-02-15","2015-02-16","2015-02-17","2015-02-18","2015-02-19","2015-02-20","2015-02-21","2015-02-22","2015-02-23","2015-02-24","2015-02-25","2015-02-26","2015-02-27","2015-02-28","2015-03-01","2015-03-02","2015-03-03","2015-03-04","2015-03-05","2015-03-06","2015-03-07","2015-03-08","2015-03-09","2015-03-10","2015-03-11","2015-03-12","2015-03-13","2015-03-14","2015-03-15","2015-03-16","2015-03-17","2015-03-18","2015-03-19","2015-03-20","2015-03-21","2015-03-22","2015-03-23","2015-03-24","2015-03-25","2015-03-26","2015-03-27","2015-03-28","2015-03-29","2015-03-30","2015-03-31","2015-04-01","2015-04-02","2015-04-03","2015-04-04","2015-04-05","2015-04-06","2015-04-07","2015-04-08","2015-04-09","2015-04-10","2015-04-11","2015-04-12","2015-04-13","2015-04-14","2015-04-15","2015-04-16","2015-04-17","2015-04-18","2015-04-19","2015-04-20","2015-04-21","2015-04-22","2015-04-23","2015-04-24","2015-04-25","2015-04-26","2015-04-27","2015-04-28","2015-04-29","2015-04-30","2015-05-01","2015-05-02","2015-05-03","2015-05-04","2015-05-05","2015-05-06","2015-05-07","2015-05-08","2015-05-09","2015-05-10","2015-05-11","2015-05-12","2015-05-13","2015-05-14","2015-05-15","2015-05-16","2015-05-17","2015-05-18","2015-05-19","2015-05-20","2015-05-21","2015-05-22","2015-05-23","2015-05-24","2015-05-25"]
[1,"TOMAS CESAR AUGUSTO ZEGARRA DONGO","AII-a","REV","HYUNDAY","I10","M1","V3E-510",145327,145127,145488,{"$f":"+K2-J2","v":361},{"$f":"+K2-I2","v":161},145727,146118,146118,23860,null,null,null,null,null,null,null,23865,23870,null,null,null,null,null,null,null,null,null,23988,null,null,null,24002,null,null,null,null,null,null,null,null,null,null,null,null,null,null,null,24075]
[2,"TOMAS CESAR AUGUSTO ZEGARRA DONGO","AII-a","PROFE","HYUNDAY","I10","M1","V20-692",4960,4460,null,null,null,null,null,5251,25000]
[3,"TOMAS CESAR AUGUSTO ZEGARRA DONGO","AII-a","PROFE","VOLKWAGEN","AUTOMOVIL","M1","A4O-540",null,null,null,null,null,null,null,null,122000]
[4,"TOMAS CESAR AUGUSTO ZEGARRA DONGO","AII-a","PROFE","CHEVROLET","AUTOMOVIL","M1","C9X-061",null,null,null,null,null,null,null,null,23500]
[5,"TOMAS CESAR AUGUSTO ZEGARRA DONGO","AII-a","PROFE","CHEVROLET","SPARK","M1","V2H-235"]
[6,"REMO SOSA MORALES","AII-a","PROFE","CHEVROLET","SPARK","M1","V2K-037",null,null,null,null,null,null,null,null,23478]
[7,"REMO SOSA MORALES","AII-a","PROFE","LIFAN","AUTOMOVIL","M1","V4B-182",null,null,null,null,null,null,null,null,19693]
[8,"EZEQUIEL HERMILIO AVALOS BRAVO","AII-b","REV","HYUNDAY","H1 MINIVAN","M2","X1A-960",5207,4707,null,null,null,null,5163,7575,146000,null,null,null,null,null,null,null,null,null,null,null,null,null,null,null,null,null,null,null,null,null,null,null,null,null,146778,146798,146816,146860,146875,146931,147532,148260,148556,null,null,null,null,148595,148620]
[9,"JAVIER JAIME RAMOS FERNANDEZ","AII-b","PROFE","HYUNDAY","H1 MINIVAN","M2","C2C-474",null,null,null,null,null,null,null,null,5000]
[10,"JAVIER JAIME RAMOS FERNANDEZ","AII-b","PROFE","HYUNDAY","H1 MINIVAN","M2","V2Q-957",null,null,null,null,null,null,null,null,7500]
[11,"JAVIER JAIME RAMOS FERNANDEZ","AII-b","PROFE","YUEJIN","NJ1028DB","N2","V3U-885",null,null,null,null,null,null,null,null,68192,null,null,null,null,null,null,null,null,null,68197,68202,68207,"X","X",68217,68212,"X",68222,"X",68227,"X","X","X","X","X",68232,"X","X","X","X",68242,68237,null,68311,68340,68370,68395,68430,68460,68490]
[12,"JAVIER JAIME RAMOS FERNANDEZ","AII-b","PROFE","FOTON","CAMIONCITO","N2","C7F-786",null,null,null,null,null,null,null,null,2500]
[13,"JAVIER JAIME RAMOS FERNANDEZ","AII-b","PROFE","JMC","CAMIONCITO","N2","V4X-832",null,null,null,null,null,null,null,null,75250]
[14,"CARLOS JAVIER RODOLFO MORRIBERON ROSAS","AIII-a - AIII-c","PROFE","MITSUBISHI","FUSO MF-100","M3","UH-5176",null,null,null,null,null,null,null,null,183850,null,null,null,null,null,null,null,null,null,null,null,null,null,null,null,null,null,null,null,null,null,null,null,null,null,null,null,null,null,null,null,null,null,183855,null,null,null,183870,183975,null,null,null,184004]
[15,"CARLOS JAVIER RODOLFO MORRIBERON ROSAS","AIII-a  - AIII-c","PROFE","HYUNDAY","OMNIBUS","M3","V2T-951",null,null,null,null,null,null,null,null,250500]
[16,"CARLOS JAVIER RODOLFO MORRIBERON ROSAS","AIII-b - AIII-c","REV","HYUNDAY","MIGHTY","N3","B8V-870",null,null,null,null,null,null,null,null,260015]
[17,"JOAQUIN TICONA ","AIII-b - AIII-c","PROFE","VOLVO","CAMION","N3","V4C-942",null,null,null,null,null,null,null,null,185000,null,null,185005,"X","X","X","X","X","X","X",185065,"X","X","X",185070,"X",185075,"X","X","X","X",185090,"X","X","X","X","X","X",186010,"x","x","x",186025]
[18,"JOAQUIN TICONA ","AIII-b - AIII-c","PROFE","FIAT","CAMION","N3","WQ-7152",null,null,null,null,null,null,null,null,668050]
[19,null,"L5",null,"ZONGSHEN","ZS175ZK trimoto","L5","V1-6404"]

{"sheet":"Hoja1","index":2,"n_rows":7,"n_cols":3,"rows_kept":7,"cut":false,"hidden":false,"merged":[]}
["CURSO","LICENCIA","RESULTADO"]
["RECATEGORIZACION","AI","ARCHIVO"]
["PROFESIONALIZACION","AIIa"]
["REVALIDACION","AIIb"]
["SENSIBILIZACION","AIIIa"]
["TOLERANCIA CERO","AIIIb"]
[null,"AIIIc"]

{"sheet":"Hoja3","index":3,"n_rows":9,"n_cols":6,"rows_kept":9,"cut":false,"hidden":false,"merged":[]}
["CODIGO","MARCA","MODELO","CLASE","PLACA"]
[1,"HYUNDAY","I10","M1","V3E-510","REV"]
[2,"CHEVROLET","SPARK","M1","V2K-037","PR"]
[3,"LIFAN","AUTOMOVIL","M1","V4B-182","PRAI"]
[4,"HYUNDAY","H1 MINIVAN","M2","X1A-960","REV"]
[5,"YUEJIN","NJ1028DB","N2","V3U-885","PR"]
[6,"MITSUBISHI","FUSO MF-100","M3","UH-5176","PR"]
[7,"HYUNDAY","MIGHTY","N3","B8V-870","REV"]
[9,"FIAT","CAMION","N3","WQ-7152","P"]

{"sheet":"Hoja2","index":4,"n_rows":0,"n_cols":0,"rows_kept":0,"cut":false,"hidden":false,"merged":[]}