{"text_format":"1","workbook":"xlsx","n_sheets":2,"sheets":["Registro","Datos"],"not_rendered":{"charts":3,"images":4,"macros":1,"external_links":0,"defined_names":12,"comments":0,"pivot_tables":0},"unopened":[],"bounds":{"document_bytes":16777216,"sheet_cells":100000,"rows_first":2000,"rows_last":500,"rows_between":2000,"halvings":0,"cell_chars":16384,"cell_head_chars":4096},"cells_cut":0,"cells_raw":0,"read":"whole","date_system":"1900"}

{"sheet":"Registro","index":0,"n_rows":47,"n_cols":31,"rows_kept":47,"cut":false,"hidden":false,"merged":[[8,23,8,24],[15,23,15,24],[20,23,20,24],[10,23,10,24],[27,45,27,46],[13,5,13,6],[24,0,24,1],[25,0,25,1],[26,0,26,1],[21,11,22,11],[23,11,24,11],[25,11,26,11],[17,11,18,11],[17,0,17,1],[13,11,14,11],[15,11,16,11],[18,0,18,1],[13,0,13,2],[21,5,21,6],[20,5,20,6],[27,11,28,11],[28,0,28,1],[22,0,22,1],[19,11,20,11],[26,23,26,25],[23,0,23,1],[27,0,27,1],[19,0,19,1],[20,0,20,1],[21,0,21,1],[11,0,11,1],[12,0,12,1],[11,11,12,11],[6,0,6,1],[7,0,7,1],[8,0,8,1],[46,31,46,36],[29,11,30,11],[31,10,31,11],[29,0,29,1],[29,14,29,15],[31,12,31,13],[30,0,30,1],[33,13,36,13],[34,4,34,5],[3,11,4,11],[5,11,6,11],[7,11,8,11],[9,11,10,11],[5,0,5,1],[9,0,9,1],[10,0,10,1],[0,14,0,22],[1,24,2,24],[1,30,2,30],[0,23,0,30],[1,11,2,11],[0,0,1,0],[0,1,0,2],[1,1,1,2],[3,0,3,1],[4,0,4,1],[2,0,2,1]]}
["PC10.02","Validación: 16/10/19",null,null,null,null,null,"Lectura","Patrón","Incognita","ABA","ABBA","Eliminar","Criterio","Sumatoria de Pesas",null,null,null,null,null,null,null,null,"Sobrecarga / Incógnita"]
[null,"Vigencia: Noviembre 2019",null,null,null,null,null,{"$f":"IF($C$22=\"ABA\",IF(J3=\"\",\"\",1),IF(J3=\"\",\"\",1))","v":1},0,40,{"$f":"IF($M$2=0,\"\",IF($I$3=\"\",\"\",IF($C$22=\"ABA\",($J$2-(AVERAGE($I$2:$I$3))),\"\")))","v":40},{"$f":"IF($M$2=0,\"\",IF($J$3=\"\",\"\",IF($C$22=\"ABBA\",(AVERAGE($J$2:$J$3)-AVERAGE($I$2:$I$3)),\"\")))","v":""},1,{"$f":"IF($C$22=\"ABA\",IFERROR(((K2-$D$18)/$D$19),\"\"),IF($C$22=\"ABBA\",IFERROR(((L2-$D$18)/$D$19),\"\")))","v":""},"mp / g","Id.","Ep / mg","Up / mg","V / cm3","rp [g / cm3]","Uρ [kg / cm3]","Código","Certificado","msi","Id.","esi","Usi","Vsi","rsi","Usi","Certificado"]
["Código:",null,3,null,null,null,null,{"$f":"IF($C$22=\"ABA\",IF(J3=\"\",\"\",H2+1),\"\")","v":2},0,41,{"$f":"IF($M$3=0,\"\",IF($I$4=\"\",\"\",IF($C$22=\"ABA\",($J$3-(AVERAGE($I$3:$I$4))),\"\")))","v":40},null,1,"",500,"-",{"$f":"IF(OR(O3=\"\",P3=\"\",W3=\"\"),\"\",INDEX(#REF!,MATCH(W3&O3&P3,#REF!&#REF!&#REF!,0),4))","v":{"$error":"#REF!"}},{"$f":"IF(OR(O3=\"\",P3=\"\",W3=\"\"),\"\",INDEX(#REF!,MATCH(W3&O3&P3,#REF!&#REF!&#REF!,0),5))","v":{"$error":"#REF!"}},{"$f":"IFERROR(IF(O3=\"\",\"\",O3/T3),\"\")","v":""},{"$f":"IF(OR(O3=\"\",P3=\"\",W3=\"\"),\"\",INDEX(#REF!,MATCH(W3&O3&P3,#REF!&#REF!&#REF!,0),6))","v":{"$error":"#REF!"}},{"$f":"IF(OR(O3=\"\",P3=\"\",W3=\"\"),\"\",INDEX(#REF!,MATCH(W3&O3&P3,#REF!&#REF!&#REF!,0),7))","v":{"$error":"#REF!"}},{"$f":"IF(OR(O3=\"\",P3=\"\",W3=\"\"),\"\",INDEX(#REF!,MATCH(W3&O3&P3,#REF!&#REF!&#REF!,0),8))","v":{"$error":"#REF!"}},"27208-F-0619","g",null,"mg","mg","cm3","g / cm3","g / cm3"]
["Fecha:",null,"2020-01-23",null,null,null,null,{"$f":"IF($C$22=\"ABA\",IF(J4=\"\",\"\",H3+1),IF(J5=\"\",\"\",H2+1))","v":3},2,42,{"$f":"IF($M$4=0,\"\",IF($I$5=\"\",\"\",IF($C$22=\"ABA\",($J$4-(AVERAGE($I$4:$I$5))),\"\")))","v":40.5},{"$f":"IF($M$4=0,\"\",IF($J$5=\"\",\"\",IF($C$22=\"ABBA\",(AVERAGE($J$4:$J$5)-AVERAGE($I$4:$I$5)),\"\")))","v":""},1,"","","",{"$f":"IF(OR(O4=\"\",P4=\"\",W4=\"\"),\"\",INDEX(#REF!,MATCH(W4&O4&P4,#REF!&#REF!&#REF!,0),4))","v":""},{"$f":"IF(OR(O4=\"\",P4=\"\",W4=\"\"),\"\",INDEX(#REF!,MATCH(W4&O4&P4,#REF!&#REF!&#REF!,0),5))","v":""},"",{"$f":"IF(OR(O4=\"\",P4=\"\",W4=\"\"),\"\",INDEX(#REF!,MATCH(W4&O4&P4,#REF!&#REF!&#REF!,0),6))","v":""},{"$f":"IF(OR(O4=\"\",P4=\"\",W4=\"\"),\"\",INDEX(#REF!,MATCH(W4&O4&P4,#REF!&#REF!&#REF!,0),7))","v":""},{"$f":"IF(OR(O4=\"\",P4=\"\",W4=\"\"),\"\",INDEX(#REF!,MATCH(W4&O4&P4,#REF!&#REF!&#REF!,0),8))","v":""},"","","",{"$f":"IF(OR(X4=\"\",Y4=\"\",AE4=\"\"),\"\",INDEX(#REF!,MATCH(AE4&X4&Y4,#REF!&#REF!&#REF!,0),4))","v":""},{"$f":"IF(OR(X4=\"\",Y4=\"\",AE4=\"\"),\"\",INDEX(#REF!,MATCH(AE4&X4&Y4,#REF!&#REF!&#REF!,0),5))","v":""},{"$f":"IFERROR(IF(X4=\"\",\"\",X4/AC4),\"\")","v":""},{"$f":"IF(OR(X4=\"\",Y4=\"\",AE4=\"\"),\"\",INDEX(#REF!,MATCH(AE4&X4&Y4,#REF!&#REF!&#REF!,0),6))","v":""},{"$f":"IF(OR(X4=\"\",Y4=\"\",AE4=\"\"),\"\",INDEX(#REF!,MATCH(AE4&X4&Y4,#REF!&#REF!&#REF!,0),7))","v":""},""]
["Cliente:",null,"Ortelli & Cia",null,null,null,null,{"$f":"IF($C$22=\"ABA\",IF(J5=\"\",\"\",H4+1),\"\")","v":4},1,41,{"$f":"IF($M$5=0,\"\",IF($I$6=\"\",\"\",IF($C$22=\"ABA\",($J$5-(AVERAGE($I$5:$I$6))),\"\")))","v":40},null,1,"","","",{"$f":"IF(OR(O5=\"\",P5=\"\",W5=\"\"),\"\",INDEX(#REF!,MATCH(W5&O5&P5,#REF!&#REF!&#REF!,0),4))","v":""},{"$f":"IF(OR(O5=\"\",P5=\"\",W5=\"\"),\"\",INDEX(#REF!,MATCH(W5&O5&P5,#REF!&#REF!&#REF!,0),5))","v":""},"",{"$f":"IF(OR(O5=\"\",P5=\"\",W5=\"\"),\"\",INDEX(#REF!,MATCH(W5&O5&P5,#REF!&#REF!&#REF!,0),6))","v":""},{"$f":"IF(OR(O5=\"\",P5=\"\",W5=\"\"),\"\",INDEX(#REF!,MATCH(W5&O5&P5,#REF!&#REF!&#REF!,0),7))","v":""},{"$f":"IF(OR(O5=\"\",P5=\"\",W5=\"\"),\"\",INDEX(#REF!,MATCH(W5&O5&P5,#REF!&#REF!&#REF!,0),8))","v":""},"","","",{"$f":"IF(OR(X5=\"\",Y5=\"\",AE5=\"\"),\"\",INDEX(#REF!,MATCH(AE5&X5&Y5,#REF!&#REF!&#REF!,0),4))","v":""},{"$f":"IF(OR(X5=\"\",Y5=\"\",AE5=\"\"),\"\",INDEX(#REF!,MATCH(AE5&X5&Y5,#REF!&#REF!&#REF!,0),5))","v":""},{"$f":"IFERROR(IF(X5=\"\",\"\",X5/AC5),\"\")","v":""},{"$f":"IF(OR(X5=\"\",Y5=\"\",AE5=\"\"),\"\",INDEX(#REF!,MATCH(AE5&X5&Y5,#REF!&#REF!&#REF!,0),6))","v":""},{"$f":"IF(OR(X5=\"\",Y5=\"\",AE5=\"\"),\"\",INDEX(#REF!,MATCH(AE5&X5&Y5,#REF!&#REF!&#REF!,0),7))","v":""},""]
["O.T.",null,28470,null,null,null,null,{"$f":"IF($C$22=\"ABA\",IF(J6=\"\",\"\",H5+1),IF(J7=\"\",\"\",H4+1))","v":5},1,42,{"$f":"IF($M$6=0,\"\",IF($I$7=\"\",\"\",IF($C$22=\"ABA\",($J$6-(AVERAGE($I$6:$I$7))),\"\")))","v":40.5},{"$f":"IF($M$6=0,\"\",IF($J$7=\"\",\"\",IF($C$22=\"ABBA\",(AVERAGE($J$6:$J$7)-AVERAGE($I$6:$I$7)),\"\")))","v":""},1,"","","",{"$f":"IF(OR(O6=\"\",P6=\"\",W6=\"\"),\"\",INDEX(#REF!,MATCH(W6&O6&P6,#REF!&#REF!&#REF!,0),4))","v":""},{"$f":"IF(OR(O6=\"\",P6=\"\",W6=\"\"),\"\",INDEX(#REF!,MATCH(W6&O6&P6,#REF!&#REF!&#REF!,0),5))","v":""},"",{"$f":"IF(OR(O6=\"\",P6=\"\",W6=\"\"),\"\",INDEX(#REF!,MATCH(W6&O6&P6,#REF!&#REF!&#REF!,0),6))","v":""},{"$f":"IF(OR(O6=\"\",P6=\"\",W6=\"\"),\"\",INDEX(#REF!,MATCH(W6&O6&P6,#REF!&#REF!&#REF!,0),7))","v":""},{"$f":"IF(OR(O6=\"\",P6=\"\",W6=\"\"),\"\",INDEX(#REF!,MATCH(W6&O6&P6,#REF!&#REF!&#REF!,0),8))","v":""},"","","",{"$f":"IF(OR(X6=\"\",Y6=\"\",AE6=\"\"),\"\",INDEX(#REF!,MATCH(AE6&X6&Y6,#REF!&#REF!&#REF!,0),4))","v":""},{"$f":"IF(OR(X6=\"\",Y6=\"\",AE6=\"\"),\"\",INDEX(#REF!,MATCH(AE6&X6&Y6,#REF!&#REF!&#REF!,0),5))","v":""},{"$f":"IFERROR(IF(X6=\"\",\"\",X6/AC6),\"\")","v":""},{"$f":"IF(OR(X6=\"\",Y6=\"\",AE6=\"\"),\"\",INDEX(#REF!,MATCH(AE6&X6&Y6,#REF!&#REF!&#REF!,0),6))","v":""},{"$f":"IF(OR(X6=\"\",Y6=\"\",AE6=\"\"),\"\",INDEX(#REF!,MATCH(AE6&X6&Y6,#REF!&#REF!&#REF!,0),7))","v":""},""]
["Clase:",null,"M2",null,null,null,null,{"$f":"IF($C$22=\"ABA\",IF(J7=\"\",\"\",H6+1),\"\")","v":""},2,"",{"$f":"IF($M$7=0,\"\",IF($I$8=\"\",\"\",IF($C$22=\"ABA\",($J$7-(AVERAGE($I$7:$I$8))),\"\")))","v":""},null,1,"","","",{"$f":"IF(OR(O7=\"\",P7=\"\",W7=\"\"),\"\",INDEX(#REF!,MATCH(W7&O7&P7,#REF!&#REF!&#REF!,0),4))","v":""},{"$f":"IF(OR(O7=\"\",P7=\"\",W7=\"\"),\"\",INDEX(#REF!,MATCH(W7&O7&P7,#REF!&#REF!&#REF!,0),5))","v":""},"",{"$f":"IF(OR(O7=\"\",P7=\"\",W7=\"\"),\"\",INDEX(#REF!,MATCH(W7&O7&P7,#REF!&#REF!&#REF!,0),6))","v":""},{"$f":"IF(OR(O7=\"\",P7=\"\",W7=\"\"),\"\",INDEX(#REF!,MATCH(W7&O7&P7,#REF!&#REF!&#REF!,0),7))","v":""},{"$f":"IF(OR(O7=\"\",P7=\"\",W7=\"\"),\"\",INDEX(#REF!,MATCH(W7&O7&P7,#REF!&#REF!&#REF!,0),8))","v":""},"","","",{"$f":"IF(OR(X7=\"\",Y7=\"\",AE7=\"\"),\"\",INDEX(#REF!,MATCH(AE7&X7&Y7,#REF!&#REF!&#REF!,0),4))","v":""},{"$f":"IF(OR(X7=\"\",Y7=\"\",AE7=\"\"),\"\",INDEX(#REF!,MATCH(AE7&X7&Y7,#REF!&#REF!&#REF!,0),5))","v":""},{"$f":"IFERROR(IF(X7=\"\",\"\",X7/AC7),\"\")","v":""},{"$f":"IF(OR(X7=\"\",Y7=\"\",AE7=\"\"),\"\",INDEX(#REF!,MATCH(AE7&X7&Y7,#REF!&#REF!&#REF!,0),6))","v":""},{"$f":"IF(OR(X7=\"\",Y7=\"\",AE7=\"\"),\"\",INDEX(#REF!,MATCH(AE7&X7&Y7,#REF!&#REF!&#REF!,0),7))","v":""},""]
["Valor nominal / g",null,500,null,null,null,null,{"$f":"IF($C$22=\"ABA\",IF(J8=\"\",\"\",H7+1),IF(J9=\"\",\"\",H6+1))","v":""},"","",{"$f":"IF($M$8=0,\"\",IF($I$9=\"\",\"\",IF($C$22=\"ABA\",($J$8-(AVERAGE($I$8:$I$9))),\"\")))","v":""},{"$f":"IF($M$8=0,\"\",IF($J$9=\"\",\"\",IF($C$22=\"ABBA\",(AVERAGE($J$8:$J$9)-AVERAGE($I$8:$I$9)),\"\")))","v":""},1,"","","",{"$f":"IF(OR(O8=\"\",P8=\"\",W8=\"\"),\"\",INDEX(#REF!,MATCH(W8&O8&P8,#REF!&#REF!&#REF!,0),4))","v":""},{"$f":"IF(OR(O8=\"\",P8=\"\",W8=\"\"),\"\",INDEX(#REF!,MATCH(W8&O8&P8,#REF!&#REF!&#REF!,0),5))","v":""},"",{"$f":"IF(OR(O8=\"\",P8=\"\",W8=\"\"),\"\",INDEX(#REF!,MATCH(W8&O8&P8,#REF!&#REF!&#REF!,0),6))","v":""},{"$f":"IF(OR(O8=\"\",P8=\"\",W8=\"\"),\"\",INDEX(#REF!,MATCH(W8&O8&P8,#REF!&#REF!&#REF!,0),7))","v":""},{"$f":"IF(OR(O8=\"\",P8=\"\",W8=\"\"),\"\",INDEX(#REF!,MATCH(W8&O8&P8,#REF!&#REF!&#REF!,0),8))","v":""},"","","",{"$f":"IF(OR(X8=\"\",Y8=\"\",AE8=\"\"),\"\",INDEX(#REF!,MATCH(AE8&X8&Y8,#REF!&#REF!&#REF!,0),4))","v":""},{"$f":"IF(OR(X8=\"\",Y8=\"\",AE8=\"\"),\"\",INDEX(#REF!,MATCH(AE8&X8&Y8,#REF!&#REF!&#REF!,0),5))","v":""},{"$f":"IFERROR(IF(X8=\"\",\"\",X8/AC8),\"\")","v":""},{"$f":"IF(OR(X8=\"\",Y8=\"\",AE8=\"\"),\"\",INDEX(#REF!,MATCH(AE8&X8&Y8,#REF!&#REF!&#REF!,0),6))","v":""},{"$f":"IF(OR(X8=\"\",Y8=\"\",AE8=\"\"),\"\",INDEX(#REF!,MATCH(AE8&X8&Y8,#REF!&#REF!&#REF!,0),7))","v":""},""]
["Patrón:",null,{"$f":"IF(COUNTA(O3:O29)>1,O1,V3)","v":"Sumatoria de Pesas"},null,null,null,null,{"$f":"IF($C$22=\"ABA\",IF(J9=\"\",\"\",H8+1),\"\")","v":""},"","",{"$f":"IF($M$9=0,\"\",IF($I$10=\"\",\"\",IF($C$22=\"ABA\",($J$9-(AVERAGE($I$9:$I$10))),\"\")))","v":""},null,1,"","","",{"$f":"IF(OR(O9=\"\",P9=\"\",W9=\"\"),\"\",INDEX(#REF!,MATCH(W9&O9&P9,#REF!&#REF!&#REF!,0),4))","v":""},{"$f":"IF(OR(O9=\"\",P9=\"\",W9=\"\"),\"\",INDEX(#REF!,MATCH(W9&O9&P9,#REF!&#REF!&#REF!,0),5))","v":""},"",{"$f":"IF(OR(O9=\"\",P9=\"\",W9=\"\"),\"\",INDEX(#REF!,MATCH(W9&O9&P9,#REF!&#REF!&#REF!,0),6))","v":""},{"$f":"IF(OR(O9=\"\",P9=\"\",W9=\"\"),\"\",INDEX(#REF!,MATCH(W9&O9&P9,#REF!&#REF!&#REF!,0),7))","v":""},{"$f":"IF(OR(O9=\"\",P9=\"\",W9=\"\"),\"\",INDEX(#REF!,MATCH(W9&O9&P9,#REF!&#REF!&#REF!,0),8))","v":""},"",{"$f":"SUM($X$4:$X$8)","v":0},null,{"$f":"SUM($Z$4:$Z$8)","v":0},{"$f":"SUM($AA$4:$AA$8)","v":0},{"$f":"SUM($AB$4:$AB$8)","v":0},{"$f":"IFERROR(IF(X9=\"0\",\"\",X9/AB9),\"\")","v":""}]
["Certificado:",null,{"$f":"IF(W3<>\"\",IF(COUNTA(W3:W29,AE4:AE8)>1,\"Ver Detalle\",W3),\"\")","v":"Ver Detalle"},null,null,null,null,{"$f":"IF($C$22=\"ABA\",IF(J10=\"\",\"\",H9+1),IF(J11=\"\",\"\",H8+1))","v":""},"","",{"$f":"IF($M$10=0,\"\",IF($I$11=\"\",\"\",IF($C$22=\"ABA\",($J$10-(AVERAGE($I$10:$I$11))),\"\")))","v":""},{"$f":"IF($M$10=0,\"\",IF($J$11=\"\",\"\",IF($C$22=\"ABBA\",(AVERAGE($J$10:$J$11)-AVERAGE($I$10:$I$11)),\"\")))","v":""},1,"","","",{"$f":"IF(OR(O10=\"\",P10=\"\",W10=\"\"),\"\",INDEX(#REF!,MATCH(W10&O10&P10,#REF!&#REF!&#REF!,0),4))","v":""},{"$f":"IF(OR(O10=\"\",P10=\"\",W10=\"\"),\"\",INDEX(#REF!,MATCH(W10&O10&P10,#REF!&#REF!&#REF!,0),5))","v":""},"",{"$f":"IF(OR(O10=\"\",P10=\"\",W10=\"\"),\"\",INDEX(#REF!,MATCH(W10&O10&P10,#REF!&#REF!&#REF!,0),6))","v":""},{"$f":"IF(OR(O10=\"\",P10=\"\",W10=\"\"),\"\",INDEX(#REF!,MATCH(W10&O10&P10,#REF!&#REF!&#REF!,0),7))","v":""},{"$f":"IF(OR(O10=\"\",P10=\"\",W10=\"\"),\"\",INDEX(#REF!,MATCH(W10&O10&P10,#REF!&#REF!&#REF!,0),8))","v":""},"","Volumen de Forma",""]
["Comparador/Intercambiador:",null,"C500K-B-01",null,null,null,null,{"$f":"IF($C$22=\"ABA\",IF(J11=\"\",\"\",H10+1),\"\")","v":""},"","",{"$f":"IF($M$11=0,\"\",IF($I$12=\"\",\"\",IF($C$22=\"ABA\",($J$11-(AVERAGE($I$11:$I$12))),\"\")))","v":""},null,1,"","","",{"$f":"IF(OR(O11=\"\",P11=\"\",W11=\"\"),\"\",INDEX(#REF!,MATCH(W11&O11&P11,#REF!&#REF!&#REF!,0),4))","v":""},{"$f":"IF(OR(O11=\"\",P11=\"\",W11=\"\"),\"\",INDEX(#REF!,MATCH(W11&O11&P11,#REF!&#REF!&#REF!,0),5))","v":""},"",{"$f":"IF(OR(O11=\"\",P11=\"\",W11=\"\"),\"\",INDEX(#REF!,MATCH(W11&O11&P11,#REF!&#REF!&#REF!,0),6))","v":""},{"$f":"IF(OR(O11=\"\",P11=\"\",W11=\"\"),\"\",INDEX(#REF!,MATCH(W11&O11&P11,#REF!&#REF!&#REF!,0),7))","v":""},{"$f":"IF(OR(O11=\"\",P11=\"\",W11=\"\"),\"\",INDEX(#REF!,MATCH(W11&O11&P11,#REF!&#REF!&#REF!,0),8))","v":""},"","Paralelepípedo"]
["Operador/es:",null,"A. Darío Tejada",null,null,null,null,{"$f":"IF($C$22=\"ABA\",IF(J12=\"\",\"\",H11+1),IF(J13=\"\",\"\",H10+1))","v":""},"","",{"$f":"IF($M$12=0,\"\",IF($I$13=\"\",\"\",IF($C$22=\"ABA\",($J$12-(AVERAGE($I$12:$I$13))),\"\")))","v":""},{"$f":"IF($M$12=0,\"\",IF($J$13=\"\",\"\",IF($C$22=\"ABBA\",(AVERAGE($J$12:$J$13)-AVERAGE($I$12:$I$13)),\"\")))","v":""},1,"","","",{"$f":"IF(OR(O12=\"\",P12=\"\",W12=\"\"),\"\",INDEX(#REF!,MATCH(W12&O12&P12,#REF!&#REF!&#REF!,0),4))","v":""},{"$f":"IF(OR(O12=\"\",P12=\"\",W12=\"\"),\"\",INDEX(#REF!,MATCH(W12&O12&P12,#REF!&#REF!&#REF!,0),5))","v":""},"",{"$f":"IF(OR(O12=\"\",P12=\"\",W12=\"\"),\"\",INDEX(#REF!,MATCH(W12&O12&P12,#REF!&#REF!&#REF!,0),6))","v":""},{"$f":"IF(OR(O12=\"\",P12=\"\",W12=\"\"),\"\",INDEX(#REF!,MATCH(W12&O12&P12,#REF!&#REF!&#REF!,0),7))","v":""},{"$f":"IF(OR(O12=\"\",P12=\"\",W12=\"\"),\"\",INDEX(#REF!,MATCH(W12&O12&P12,#REF!&#REF!&#REF!,0),8))","v":""},"","Largo / cm",""]
["Responsable:",null,"Francisco Dolz",null,null,null,null,{"$f":"IF($C$22=\"ABA\",IF(J13=\"\",\"\",H12+1),\"\")","v":""},"","",{"$f":"IF($M$13=0,\"\",IF($I$14=\"\",\"\",IF($C$22=\"ABA\",($J$13-(AVERAGE($I$13:$I$14))),\"\")))","v":""},null,1,"","","",{"$f":"IF(OR(O13=\"\",P13=\"\",W13=\"\"),\"\",INDEX(#REF!,MATCH(W13&O13&P13,#REF!&#REF!&#REF!,0),4))","v":""},{"$f":"IF(OR(O13=\"\",P13=\"\",W13=\"\"),\"\",INDEX(#REF!,MATCH(W13&O13&P13,#REF!&#REF!&#REF!,0),5))","v":""},"",{"$f":"IF(OR(O13=\"\",P13=\"\",W13=\"\"),\"\",INDEX(#REF!,MATCH(W13&O13&P13,#REF!&#REF!&#REF!,0),6))","v":""},{"$f":"IF(OR(O13=\"\",P13=\"\",W13=\"\"),\"\",INDEX(#REF!,MATCH(W13&O13&P13,#REF!&#REF!&#REF!,0),7))","v":""},{"$f":"IF(OR(O13=\"\",P13=\"\",W13=\"\"),\"\",INDEX(#REF!,MATCH(W13&O13&P13,#REF!&#REF!&#REF!,0),8))","v":""},"","Ancho / cm",""]
["Componentes",null,null,"Valor","Unidad","Contribución (%)",null,{"$f":"IF($C$22=\"ABA\",IF(J14=\"\",\"\",H13+1),IF(J15=\"\",\"\",H12+1))","v":""},"","",{"$f":"IF($M$14=0,\"\",IF($I$15=\"\",\"\",IF($C$22=\"ABA\",($J$14-(AVERAGE($I$14:$I$15))),\"\")))","v":""},{"$f":"IF($M$14=0,\"\",IF($J$15=\"\",\"\",IF($C$22=\"ABBA\",(AVERAGE($J$14:$J$15)-AVERAGE($I$14:$I$15)),\"\")))","v":""},1,"","","",{"$f":"IF(OR(O14=\"\",P14=\"\",W14=\"\"),\"\",INDEX(#REF!,MATCH(W14&O14&P14,#REF!&#REF!&#REF!,0),4))","v":""},{"$f":"IF(OR(O14=\"\",P14=\"\",W14=\"\"),\"\",INDEX(#REF!,MATCH(W14&O14&P14,#REF!&#REF!&#REF!,0),5))","v":""},"",{"$f":"IF(OR(O14=\"\",P14=\"\",W14=\"\"),\"\",INDEX(#REF!,MATCH(W14&O14&P14,#REF!&#REF!&#REF!,0),6))","v":""},{"$f":"IF(OR(O14=\"\",P14=\"\",W14=\"\"),\"\",INDEX(#REF!,MATCH(W14&O14&P14,#REF!&#REF!&#REF!,0),7))","v":""},{"$f":"IF(OR(O14=\"\",P14=\"\",W14=\"\"),\"\",INDEX(#REF!,MATCH(W14&O14&P14,#REF!&#REF!&#REF!,0),8))","v":""},"","Altura / cm",""]
["t(i-f)",22.6,22.7,2,"°C","Patrón",{"$f":"IFERROR((((R30+VALUE(AA9))/2)^2/B32^2)*100,\"\")","v":""},{"$f":"IF($C$22=\"ABA\",IF(J15=\"\",\"\",H14+1),\"\")","v":""},"","",{"$f":"IF($M$15=0,\"\",IF($I$16=\"\",\"\",IF($C$22=\"ABA\",($J$15-(AVERAGE($I$15:$I$16))),\"\")))","v":""},null,1,"","","",{"$f":"IF(OR(O15=\"\",P15=\"\",W15=\"\"),\"\",INDEX(#REF!,MATCH(W15&O15&P15,#REF!&#REF!&#REF!,0),4))","v":""},{"$f":"IF(OR(O15=\"\",P15=\"\",W15=\"\"),\"\",INDEX(#REF!,MATCH(W15&O15&P15,#REF!&#REF!&#REF!,0),5))","v":""},"",{"$f":"IF(OR(O15=\"\",P15=\"\",W15=\"\"),\"\",INDEX(#REF!,MATCH(W15&O15&P15,#REF!&#REF!&#REF!,0),6))","v":""},{"$f":"IF(OR(O15=\"\",P15=\"\",W15=\"\"),\"\",INDEX(#REF!,MATCH(W15&O15&P15,#REF!&#REF!&#REF!,0),7))","v":""},{"$f":"IF(OR(O15=\"\",P15=\"\",W15=\"\"),\"\",INDEX(#REF!,MATCH(W15&O15&P15,#REF!&#REF!&#REF!,0),8))","v":""},"","Volumen / cm3",{"$f":"IF($Y$14=\"\",\"\",$Y$12*$Y$13*$Y$14)","v":""}]
{"$rows_left_out":33}
{"sheet":"Datos","index":1,"n_rows":9,"n_cols":232,"rows_kept":9,"cut":false,"hidden":false,"merged":[[3,9,3,14],[3,21,3,23],[3,24,3,27],[3,29,3,30],[3,31,3,61],[3,93,3,119],[3,120,3,146],[3,147,3,173],[2,93,2,173],[2,31,2,91],[3,62,3,91],[3,199,3,207],[3,208,3,212],[3,213,3,216],[3,217,3,231],[2,174,2,188],[3,190,3,192],[3,193,3,195],[3,196,3,197],[2,190,2,197],[3,179,3,183],[3,184,3,188],[3,174,3,178]]}
[]
[]
[null,null,null,null,null,null,null,null,null,null,null,null,null,null,null,null,null,null,null,null,null,null,null,null,null,null,null,null,null,null,null,"Calibración",null,null,null,null,null,null,null,null,null,null,null,null,null,null,null,null,null,null,null,null,null,null,null,null,null,null,null,null,null,null,null,null,null,null,null,null,null,null,null,null,null,null,null,null,null,null,null,null,null,null,null,null,null,null,null,null,null,null,null,null,null,"Sumatoria de Pesas Patrones",null,null,null,null,null,null,null,null,null,null,null,null,null,null,null,null,null,null,null,null,null,null,null,null,null,null,null,null,null,null,null,null,null,null,null,null,null,null,null,null,null,null,null,null,null,null,null,null,null,null,null,null,null,null,null,null,null,null,null,null,null,null,null,null,null,null,null,null,null,null,null,null,null,null,null,null,null,null,null,null,"Sobrecarga / Incógnita",null,null,null,null,null,null,null,null,null,null,null,null,null,null,null,"Volumen de Forma"]
[null,null,null,null,null,null,null,null,null,"Datos ambientales",null,null,null,null,null,null,null,null,null,null,null,"Pesa de Sensibilidad",null,null,"Densidad",null,null,null,null,"Resultado Final",null,"Patrones",null,null,null,null,null,null,null,null,null,null,null,null,null,null,null,null,null,null,null,null,null,null,null,null,null,null,null,null,null,null,"Incógnitas",null,null,null,null,null,null,null,null,null,null,null,null,null,null,null,null,null,null,null,null,null,null,null,null,null,null,null,null,null,"Calidad","Masa / g",null,null,null,null,null,null,null,null,null,null,null,null,null,null,null,null,null,null,null,null,null,null,null,null,null,null,"Identificación/es",null,null,null,null,null,null,null,null,null,null,null,null,null,null,null,null,null,null,null,null,null,null,null,null,null,null,"Certificado/s",null,null,null,null,null,null,null,null,null,null,null,null,null,null,null,null,null,null,null,null,null,null,null,null,null,null,"Masa / g",null,null,null,null,"Identificación/es",null,null,null,null,"Certificado/s",null,null,null,null,null,"Paralelepípedo",null,null,"Pirámide Truncada",null,null,"Cilindro",null,null,"Newton",null,null,null,null,null,null,null,null,"Libra",null,null,null,null,"Sobrecarga",null,null,null,"Pesas"]
["Código","Fecha","Cliente",{"$f":"Registro!A6","v":"O.T."},"Clase","VN / g","Comparador/Intercambiador","Operador/es","Responsable","t(i)","Hr(i)","p(i)","t(f)","Hr(f)","p(f)","Sobrecarga","Método","Promedio","Desvio","Lectura + masa de sobrecarga","Error del patrón","Certificado","VN / g","ID","Lote","Patrón","Incógnita","Aire ","U combinada","Error de la Incógnita","U exp.",1,2,3,4,5,6,7,8,9,10,11,12,13,14,15,16,17,18,19,20,21,22,23,24,25,26,27,28,29,30,31,1,2,3,4,5,6,7,8,9,10,11,12,13,14,15,16,17,18,19,20,21,22,23,24,25,26,27,28,29,30,"Medición",1,2,3,4,5,6,7,8,9,10,11,12,13,14,15,16,17,18,19,20,21,22,23,24,25,26,27,1,2,3,4,5,6,7,8,9,10,11,12,13,14,15,16,17,18,19,20,21,22,23,24,25,26,27,1,2,3,4,5,6,7,8,9,10,11,12,13,14,15,16,17,18,19,20,21,22,23,24,25,26,27,1,2,3,4,5,1,2,3,4,5,1,2,3,4,5,"Material de la Sobrecarga","Largo","Ancho","Altura","Area / base menor","Area / base mayor","Altura","Diámetro","Altura","Forma","Proceso","Identificación","Grados","Minutos","Segundos","Altura","Gravedad","Fuerza","Incertidumbre","Proceso","Identificación","Valor Nominal","Incertidumbre","Diferencia / g","Proceso","Identificación","Marca","Tol. Histórica / g","Proceso","Unidad.1","Identificación","Unidad.2","Estado","N° de Serie","Observaciones","Código","Marca","Valor convencional","V / cm³ @ 20°C","Uv / cm³","V cálculo / cm³","Uv cálculo / cm³","Tol. Histórica"]
[]
[3,"2020-01-23","Ortelli & Cia",28470,"M2",500,"C500K-B-01","A. Darío Tejada","Francisco Dolz",22.6,64.2,1019,22.7,61.4,1019,"P","ABA","","",52,"","27734-T-0819",0.05,"-","","Patrón/es","Latón",1.1928376273317869,"","","",0,0,2,1,1,2,"","","","","","","","","","","","","","","","","","","","","","","","","",40,41,42,41,42,"","","","","","","","","","","","","","","","","","","","","","","","","","",500,"","","","","","","","","","","","","","","","","","","","","","","","","","","-","","","","","","","","","","","","","","","","","","","","","","","","","","","27208-F-0619","","","","","","","","","","","","","","","","","","","","","","","","","","","","","","","","","","","","","","","","","","","","","","","","","","","","","","","","","",null,"","","","","","","","Inicial","V.718","Dolz","","---","Vn / g","","Eci / g","Estado","","","","","","","",{"$error":"#REF!"},"",""]
[3,"2020-01-23","Ortelli & Cia",28470,"M2",500,"C500K-B-01","A. Darío Tejada","Francisco Dolz",22.6,64.2,1019,22.7,61.4,1019,"P","ABA",40.189548000000009,0.27379007482010737,52,1.04,"27734-T-0819",0.05,"-","","Patrón/es","Latón",1.1928376273317869,261.89121187227033,41.253679983383478,556.86278791774089,0,0,2,1,1,2,"","","","","","","","","","","","","","","","","","","","","","","","","",40,41,42,41,42,"","","","","","","","","","","","","","","","","","","","","","","","","","",500,"","","","","","","","","","","","","","","","","","","","","","","","","","","-","","","","","","","","","","","","","","","","","","","","","","","","","","","27208-F-0619","","","","","","","","","","","","","","","","","","","","","","","","","","","","","","","","","","","","","","","","","","","","","","","","","","","","","","","","","",null,"","","","","","","","Inicial","V.718","Dolz","","---","Vn / g","","Eci / g","Estado","","","","",500.04125367998336,"","",62.893081761006286,0.04,""]
[2,"2020-01-23","Ortelli & Cia",28470,"M2",500,"C500K-B-01","A. Darío Tejada","Francisco Dolz",22.6,64.2,1019,22.7,61.4,1019,"P","ABA",40.189548000000009,0.27379007482010737,52,1.04,"27734-T-0819",0.05,"-","","Patrón/es","Latón",1.1928376273317869,261.89121187227033,41.253679983383478,556.86278791774089,0,0,2,1,1,2,"","","","","","","","","","","","","","","","","","","","","","","","","",40,41,42,41,42,"","","","","","","","","","","","","","","","","","","","","","","","","","",500,"","","","","","","","","","","","","","","","","","","","","","","","","","","-","","","","","","","","","","","","","","","","","","","","","","","","","","","27208-F-0619","","","","","","","","","","","","","","","","","","","","","","","","","","","","","","","","","","","","","","","","","","","","","","","","","","","","","","","","","",null,"","","","","","","","Inicial","V.718","Dolz","","---","Vn / g","","Eci / g","Estado","","","","",500.04125367998336,"","",62.893081761006286,0.04,""]