{"text_format":"1","workbook":"xlsx","n_sheets":7,"sheets":["Pendientes old","Pendientes","Hoja1","Tablas dinamicas","Dashboard","Hoja3","Combos"],"not_rendered":{"charts":1,"images":1,"macros":1,"external_links":0,"defined_names":3,"comments":0,"pivot_tables":5},"unopened":[],"bounds":{"document_bytes":16777216,"sheet_cells":100000,"rows_first":2000,"rows_last":500,"rows_between":2000,"halvings":0,"cell_chars":16384,"cell_head_chars":4096},"cells_cut":0,"cells_raw":0,"read":"whole","date_system":"1900"}

{"sheet":"Pendientes old","index":0,"n_rows":528,"n_cols":26,"rows_kept":528,"cut":false,"hidden":true,"merged":[[0,10,0,11],[0,12,0,13]]}
[null,null,null,null,null,null,null,null,null,null,"DWG",null,"Fuerza"]
["Sitio","Nodo","Emplazamiento","Sprint","Contratista","Plan","Mesa Ingeniería","Epum","Adjudicacion","Fecha de ingreso","BPM","MAIL","BPM","MAIL","Observaciones","Fecha devolucion","Antena","observaciones","Energia","Definicion","Fuego / SOLPE","Rebote Logistica x antena","ESTADO ","Asignado","Adelanto","V"]
["BM129","CBM129","ARBA13484",null,"Ericsson","Sitios Nuevos","Completed","1279211-1",null,null,null,null,null,null,null,null,"RAN 2 - Ericsson Mudanza del sitio BM029","ok stock","Sin planilla","2019-03-12",7000079199,null,"FIN"]
["BM141","CBM141","ARBA0853","Ericsson","Sitios Nuevos","Active",null,"1317143-1",234194,"2019-04-25",null,null,null,null,null,null,null,null,null,"2019-04-26",7000079918,null,"FIN","Barbara"]
["QN084","CQN084","ARNQ0565","SPRINT BK","Tesur","SITIOS NUEVOS","Active",null,null,null,null,null,null,null,null,null,null,null,null,0,null,null,"A REASIGNAR CONTRATA","NA"]
["AC008","FAC008","ARSA0032","SPRINT BK","CIS SRL","RAN 1","On Hold",null,null,null,null,null,null,null,null,null,"ATD4516R8","falta hacer 3500",null,"2019-04-25",7000079898,null,"FIN","Rodrigo"]
["KS111","FKS111","ARBA0928","SPRINT 6","Sidaco","AMBA",0,"1232430-1",null,null,null,null,null,null,null,null,null,null,null,null,null,null,"TO DO"]
["KS126","FKS126","ARBA0976","SPRINT 6","Sidaco","AMBA",0,"1232432-1",null,null,null,null,null,null,null,null,null,null,null,null,null,null,"TO DO"]
["KS183","FKS183",null,null,"Sidaco","AMBA","Sin HW 3500","1232429-1",null,null,null,null,null,null,null,null,null,null,null,null,null,null,"TO DO"]
["OC001","FOC001","ARCT0016","SPRINT BK","CIS SRL","RAN 1","On Hold",null,null,null,null,null,null,null,null,null,"antenas TDD ingresadas / faltan las RRUS","falta hacer 3500",null,null,null,null,"TO DO"]
["QC006","FQC006","ARNQ0047","Sprint 10","Huawei","R1","On Hold",null,null,null,null,null,null,null,null,null,null,"Falta ingreso de las RRUs + Antenas TDD",null,0,0,null,"TO DO"]
["XC180","FXC180","ARCO0359","SPRINT BK","CIS SRL","RAN 1","On Hold",null,null,null,null,null,null,null,null,null,"antenas TDD ingresadas / faltan las RRUS","falta hacer 3500",null,null,null,null,"TO DO"]
["BM129","GBM129","ARBA13484",null,"Ericsson","Sitios Nuevos","Completed","1279210-1",null,null,null,null,null,null,null,null,"RAN 2 - Ericsson Mudanza del sitio BM029","ok stock","Sin planilla","2019-03-12",7000079199,null,"FIN"]
["GC310","GGC310","ARSE0288",null,"CIS SRL","Sitios Nuevos","Completed","1104316-1",null,null,null,null,null,null,null,null,"ATR4518R6 ","ok stock","OK energia","2019-03-18",7000079310,null,"FIN"]
["SR319","GSR319","ARSF1764",null,"Sidaco","Sitios Nuevos","Completed","916500-1",null,null,null,null,null,null,null,null,"ODV-065R16M18JJG / 4000084591","ok stock",null,"2019-03-18",7000079309,null,"FIN"]
["XC349","GXC349","ARCO1905","Sprint 14/15","CIS SRL","SITIOS NUEVOS","In Planning",null,null,null,null,null,null,null,null,null,"Mudanza del GXC049. Configuración (3x2).  ATR4518R6 (usar puerto libre de alta para 2G diplexado con 3G mudanza del XC049 - sitio NO RAN","Faltan los planos","fuerza OK","2019-04-11","7000079667/7000079668 ",null,"FIN","Barbara"]
["ZW012","GZW012",null,null,{"$error":"#N/A"},{"$error":"#N/A"},{"$error":"#N/A"},{"$error":"#N/A"},null,null,null,null,null,null,null,null,null,null,null,null,null,null,"TO DO"]
["KS323","KS323",null,null,{"$error":"#N/A"},{"$error":"#N/A"},{"$error":"#N/A"},{"$error":"#N/A"},null,null,null,null,null,null,null,null,null,null,null,null,null,null,"TO DO"]
["KS348","KS348",null,null,{"$error":"#N/A"},{"$error":"#N/A"},{"$error":"#N/A"},{"$error":"#N/A"},null,null,null,null,null,null,null,null,null,null,null,null,null,null,"TO DO"]
["KS463","KS463",null,null,{"$error":"#N/A"},{"$error":"#N/A"},{"$error":"#N/A"},{"$error":"#N/A"},null,null,null,null,null,null,null,null,null,null,null,null,null,null,"TO DO"]
["KS496","KS496",null,null,{"$error":"#N/A"},{"$error":"#N/A"},{"$error":"#N/A"},{"$error":"#N/A"},null,null,null,null,null,null,null,null,null,null,null,null,null,null,"TO DO"]
["AN003","LAN003",null,"S16",null,0,0,null,null,null,null,null,null,null,null,null,"ASI4517R3V06 ( Grande)",null,null,null,null,null,"SIN STOCK"]
["BB482","LBB482",null,null,"Guzman Nacich","RAN 1","Completed",null,null,null,null,null,null,null,null,null,null,null,null,"2019-03-29",7000079247,null,"FIN"]
["BM129","LBM129","ARBA13484",null,"Ericsson","Sitios Nuevos","Completed","1279212-1",null,null,null,null,null,null,null,null,"RAN 2 - Ericsson Mudanza del sitio BM029","ok stock","Sin planilla","2019-03-12",7000079199,null,"FIN"]
["BM141","LBM141","ARBA0853","Ericsson","Sitios Nuevos","Active",null,"1317142-1",234193,"2019-04-25",null,null,null,null,null,null,null,null,null,"2019-04-26",7000079918,null,"FIN","Barbara"]
["BM795","LBM795","ARBA13155","Guzmán Nacich","Sitios Nuevos","Active",null,"944039-1",210150,"2019-04-25",null,null,null,null,null,null,null,null,null,null,null,null,"TO DO"]
["BN901","LBN901","ARBA13471",null,"Tesur","SITIOS NUEVOS","Active",null,null,null,null,null,null,null,null,null,"Tribanda trisector","sin stock","ok ingenieria / falta actualizar  ingenieria fuerza","2019-03-25",7000079430,null,"FIN"]
["BO013","LBO013","ARBA13267","Ericsson","Sitios Nuevos","Active",null,"1115549-1",235504,"2019-04-25",null,null,null,null,null,null,null,null,null,null,null,null,"TO DO"]
["BO018","LBO018",0,null,"Sidaco","SITIO NUEVO","Planificar Ing","1331410-1",null,null,null,null,null,null,null,null,null,null,null,null,null,null,"TO DO"]
["BS144","LBS144",null,null,null,null,"Active",null,null,null,null,null,null,null,null,null,null,null,null,"2019-03-06",7000079131,null,"FIN"]
{"$rows_left_out":499}
{"sheet":"Pendientes","index":1,"n_rows":742,"n_cols":30,"rows_kept":742,"cut":false,"hidden":false,"merged":[]}
[]
[]
[]
["NODO","FECHA_DE_INGRESO","PROPIETARIO","PRIORIDAD","DWG_BPM","DWG_MAIL","DWG_IU","MATERIALES_BPM","MATERIALES_MAIL","MATERIALES_IU","FUERZA_BPM","FUERZA_MAIL","FUERZA_IU","OBSERVACIONES_INGRESO","ESTADO ","SOLPE_FUEGO","FECHA_FIN","HORAS_ESTIMADAS","OBSERVACIONES_FINALES","ANTENA_TIPO","ENERGIA","Verificaciones","Pedido Remo","Contratista","Prio","Programacion","Sitio","EPUM","diferencia","Rango"]
["a","2019-01-28","a","xxx","xxx","xxx","xx","xx","xx","xx","xx","xx","xx","xx","xx","xx","2019-02-18","xx","xx","xx","xx","v","v","xx","v","x","x","x","x",{"$f":"VLOOKUP(Pendientes!$AC5,Hoja1!A:B,2,TRUE)","v":{"$error":"#N/A"}}]
["WQE022","2019-05-09","Cristian","Adelanto","No","No","No","No","No","No","No","Si","No","Borde Montuoso - evento IDEA ","FIN",7000080211,"2019-05-13",null,"Sale con el HW sw Fri Music Neuquen","ASI4518R14v06","Nueva",null,null,"Multiradio",null,{"$error":"#N/A"},null,null,{"$f":"Pendientes!$Q6-Pendientes!$B6","v":4},{"$f":"VLOOKUP(Pendientes!$AC6,Hoja1!A:B,2,TRUE)","v":"Entre 3 y 5 dias"}]
["MQE022","2019-05-09","Cristian","Adelanto","No","No","No","No","No","No","No","Si","No","Borde Montuoso - evento IDEA ","FIN",7000080211,"2019-05-13",null,"Sale con el HW sw Fri Music Neuquen","ASI4518R14v06","Nueva",null,null,"Multiradio",null,{"$error":"#N/A"},null,null,{"$f":"Pendientes!$Q7-Pendientes!$B7","v":4},{"$f":"VLOOKUP(Pendientes!$AC7,Hoja1!A:B,2,TRUE)","v":"Entre 3 y 5 dias"}]
["JS006","2019-05-06","Barbara","Adelanto","No","No","No","No","Si","No","No","No","No","SIN INFORMACION - ADELANTO OBLIGACIONES - REALIZA O&M - MATERIAL LOGISTICA INVERSA","FIN",7000080223,"2019-05-10",null,null,"EXISTENTE","EXISTENTE",null,null,"PEM",null,{"$error":"#N/A"},null,null,{"$f":"Pendientes!$Q8-Pendientes!$B8","v":4},{"$f":"VLOOKUP(Pendientes!$AC8,Hoja1!A:B,2,TRUE)","v":"Entre 3 y 5 dias"}]
["JW018","2019-05-06","Barbara","Adelanto","No","No","No","No","Si","No","No","No","No","SIN INFORMACION - ADELANTO OBLIGACIONES - REALIZA O&M - MATERIAL LOGISTICA INVERSA","FIN",7000080223,"2019-05-10",null,null,"EXISTENTE","EXISTENTE",null,null,"PEM",null,{"$error":"#N/A"},null,null,{"$f":"Pendientes!$Q9-Pendientes!$B9","v":4},{"$f":"VLOOKUP(Pendientes!$AC9,Hoja1!A:B,2,TRUE)","v":"Entre 3 y 5 dias"}]
["JS027","2019-05-06","Barbara","Adelanto","No","No","No","No","Si","No","No","No","No","SIN INFORMACION - ADELANTO OBLIGACIONES - REALIZA O&M - MATERIAL LOGISTICA INVERSA","FIN",7000080223,"2019-05-10",null,null,"EXISTENTE","EXISTENTE",null,null,"PEM",null,{"$error":"#N/A"},null,null,{"$f":"Pendientes!$Q10-Pendientes!$B10","v":4},{"$f":"VLOOKUP(Pendientes!$AC10,Hoja1!A:B,2,TRUE)","v":"Entre 3 y 5 dias"}]
["JS028","2019-05-06","Barbara","Adelanto","No","No","No","No","Si","No","No","No","No","SIN INFORMACION - ADELANTO OBLIGACIONES - REALIZA O&M - MATERIAL LOGISTICA INVERSA","FIN",7000080223,"2019-05-10",null,null,"EXISTENTE","EXISTENTE",null,null,"PEM",null,{"$error":"#N/A"},null,null,{"$f":"Pendientes!$Q11-Pendientes!$B11","v":4},{"$f":"VLOOKUP(Pendientes!$AC11,Hoja1!A:B,2,TRUE)","v":"Entre 3 y 5 dias"}]
["JS009","2019-05-06","Barbara","Adelanto","No","No","No","No","Si","No","No","No","No","SIN INFORMACION - ADELANTO OBLIGACIONES - REALIZA O&M - MATERIAL LOGISTICA INVERSA","FIN",7000080223,"2019-05-10",null,null,"EXISTENTE","EXISTENTE",null,null,"PEM",null,{"$error":"#N/A"},null,null,{"$f":"Pendientes!$Q12-Pendientes!$B12","v":4},{"$f":"VLOOKUP(Pendientes!$AC12,Hoja1!A:B,2,TRUE)","v":"Entre 3 y 5 dias"}]
["CBM129","2019-03-11","Rodrigo",null,null,null,null,null,null,null,"Sin planilla",null,null,"RAN 2 - Ericsson Mudanza del sitio BM029","FIN",7000079199,"2019-03-12",null,null,null,null,null,null,"Ericsson",0,"Fin Semana 2 Marzo","BM129","1279211-1",{"$f":"Pendientes!$Q13-Pendientes!$B13","v":1},{"$f":"VLOOKUP(Pendientes!$AC13,Hoja1!A:B,2,TRUE)","v":"en 24hs"}]
["CBM141","2019-04-25","Barbara",null,null,null,null,null,null,null,null,null,null,null,"FIN",7000079918,"2019-04-26",null,null,null,"Nueva",null,null,"Ericsson",0,"Semana 3 Mayo","BM141","1317143-1",{"$f":"Pendientes!$Q14-Pendientes!$B14","v":1},{"$f":"VLOOKUP(Pendientes!$AC14,Hoja1!A:B,2,TRUE)","v":"en 24hs"}]
["CBT111","09/05/2019","Lucrecia","Prio 3","No","No","No","Si","No","No","No","No","No","13-05 FALTA DWG","PENDIENTE INGENIERIA ","",null,"","","","",null,null,"PEM",null,"Fin Semana 1 Mayo","BT111","1249631-1",{"$f":"Pendientes!$Q15-Pendientes!$B15","v":-43594},{"$f":"VLOOKUP(Pendientes!$AC15,Hoja1!A:B,2,TRUE)","v":{"$error":"#N/A"}}]
["CMS025","2019-05-09","Ricky","Prio 3","No","No","No","No","No","No","No","No","No","14/5:No hay información en BPM","PENDIENTE INGENIERIA ",null,null,null,null,null,null,null,null,"Sidaco",null,"Semana 4 Mayo","MS025",null,{"$f":"Pendientes!$Q16-Pendientes!$B16","v":-43594},{"$f":"VLOOKUP(Pendientes!$AC16,Hoja1!A:B,2,TRUE)","v":{"$error":"#N/A"}}]
["CQN084",null,"Pendiente",null,null,null,null,null,null,null,null,null,null,null,"A REASIGNAR CONTRATA",null,null,null,null,null,null,null,null,"Sin Asignacion",0,"Vaca Muerta","QN084","516212-1",{"$f":"Pendientes!$Q17-Pendientes!$B17","v":0},{"$f":"VLOOKUP(Pendientes!$AC17,Hoja1!A:B,2,TRUE)","v":"en 24hs"}]
["FAC008",null,"Rodrigo",null,null,null,null,null,null,null,null,null,null,"falta hacer 3500","FIN",7000079898,"2019-04-25",null,null,"ATD4516R8",null,null,null,"CIS SRL",0,"Fin Semana 2 Mayo","AC008","1081392-1",{"$f":"Pendientes!$Q18-Pendientes!$B18","v":43580},{"$f":"VLOOKUP(Pendientes!$AC18,Hoja1!A:B,2,TRUE)","v":"Mas de 10 días"}]
["FKS111",null,"Ricky",null,null,null,null,null,null,null,null,null,null,null,"TO DO",null,null,null,null,null,null,null,null,"Sidaco","Prio 1","Revisión Plan 3.5","KS111","1232430-1",{"$f":"Pendientes!$Q19-Pendientes!$B19","v":0},{"$f":"VLOOKUP(Pendientes!$AC19,Hoja1!A:B,2,TRUE)","v":"en 24hs"}]
["FKS126",null,"Ricky",null,null,null,null,null,null,null,null,null,null,null,"TO DO",null,null,null,null,null,null,null,null,"Sidaco","Prio 1","Revisión Plan 3.5","KS126","1232432-1",{"$f":"Pendientes!$Q20-Pendientes!$B20","v":0},{"$f":"VLOOKUP(Pendientes!$AC20,Hoja1!A:B,2,TRUE)","v":"en 24hs"}]
["FKS183",null,"Ricky",null,null,null,null,null,null,null,null,null,null,null,"TO DO",null,null,null,null,null,null,null,null,"Sidaco","Prio 1","Revisión Plan 3.5","KS183","1232429-1",{"$f":"Pendientes!$Q21-Pendientes!$B21","v":0},{"$f":"VLOOKUP(Pendientes!$AC21,Hoja1!A:B,2,TRUE)","v":"en 24hs"}]
["FOC001","2019-05-03","Barbara","","No","No","No","No","No","No","Si","No","No","10-05 PLANILLA DE FUERZA DESACTUALIZADA -SIN DWG falta hacer 3500","SIN STOCK","",null,"","","antenas TDD ingresadas / faltan las RRUS","",null,null,"CIS SRL","Prio 3","Semana 1 Junio","OC001","1081409-1",{"$f":"Pendientes!$Q22-Pendientes!$B22","v":-43588},{"$f":"VLOOKUP(Pendientes!$AC22,Hoja1!A:B,2,TRUE)","v":{"$error":"#N/A"}}]
["FQC006",null,"Rodrigo",null,"NO","NO","NO","NO","NO","NO","NO","NO","NO","Falta ingreso de las RRUs + Antenas TDD","PENDIENTE INGENIERIA ",null,null,null,null,"TDD",null,null,null,"Huawei","Prio 3","Semana 1 Junio","QC006","1081416-1",{"$f":"Pendientes!$Q23-Pendientes!$B23","v":0},{"$f":"VLOOKUP(Pendientes!$AC23,Hoja1!A:B,2,TRUE)","v":"en 24hs"}]
["FXC180","2019-05-03","Barbara","","No","No","No","No","No","No","No","No","No","10/05 SIN DWG NI PLANILLA DE FUERZA - falta hacer 3500","PENDIENTE INGENIERIA ","",null,"","","antenas TDD ingresadas / faltan las RRUS","",null,"CIS SRL","CIS SRL","Prio 3","Semana 1 Junio","XC180","1081405-1",{"$f":"Pendientes!$Q24-Pendientes!$B24","v":-43588},{"$f":"VLOOKUP(Pendientes!$AC24,Hoja1!A:B,2,TRUE)","v":{"$error":"#N/A"}}]
["GBM129","2019-03-11","Rodrigo",null,null,null,null,null,null,null,"Sin planilla",null,null,"RAN 2 - Ericsson Mudanza del sitio BM029","FIN",7000079199,"2019-03-12",null,null,null,null,null,null,"Ericsson",0,"Fin Semana 2 Marzo","BM129","1279210-1",{"$f":"Pendientes!$Q25-Pendientes!$B25","v":1},{"$f":"VLOOKUP(Pendientes!$AC25,Hoja1!A:B,2,TRUE)","v":"en 24hs"}]
["GGC310","2019-03-11",null,null,null,null,null,null,null,null,"OK energia",null,null,"ok stock","FIN",7000079310,"2019-03-18",null,null,"ATR4518R6 ",null,null,null,"CIS SRL",0,"Fin Semana 2 Marzo","GC310","1104316-1",{"$f":"Pendientes!$Q26-Pendientes!$B26","v":7},{"$f":"VLOOKUP(Pendientes!$AC26,Hoja1!A:B,2,TRUE)","v":"Entre 5 y 10 dias"}]
["GSR319",null,null,null,null,null,null,null,null,null,null,null,null,"ok stock","FIN",null,null,null,null,null,null,null,null,"Sidaco",0,"Fin Semana 2 Marzo","SR319","916500-1",{"$f":"Pendientes!$Q27-Pendientes!$B27","v":0},{"$f":"VLOOKUP(Pendientes!$AC27,Hoja1!A:B,2,TRUE)","v":"en 24hs"}]
["GXC349",null,"Barbara",null,null,null,null,null,null,null,"fuerza OK",null,null,"Faltan los planos","FIN","7000079667/7000079668 ","2019-04-11",null,null,"Mudanza del GXC049. Configuración (3x2).  ATR4518R6 (usar puerto libre de alta para 2G diplexado con 3G mudanza del XC049 - sitio NO RAN",null,null,null,"CIS SRL",0,"Fin Semana 4 Abril","XC349","1285181-1",{"$f":"Pendientes!$Q28-Pendientes!$B28","v":43566},{"$f":"VLOOKUP(Pendientes!$AC28,Hoja1!A:B,2,TRUE)","v":"Mas de 10 días"}]
["GZW012","2019-04-29","Barbara","Alta",null,null,null,null,null,null,null,null,null,null,"FIN-A",7000080017,"2019-05-02",null,"FALTA SOLPE POR ANTENAS POR FALTA DE STOCK","ASI4517R3v06","Nueva",null,null,"CIS SRL","Prio 1",null,"ZW012",{"$error":"#N/A"},{"$f":"Pendientes!$Q29-Pendientes!$B29","v":3},{"$f":"VLOOKUP(Pendientes!$AC29,Hoja1!A:B,2,TRUE)","v":"Entre 3 y 5 dias"}]
["JS040","2019-05-02","Pendiente",null,null,null,null,null,null,null,null,null,null,null,"A REASIGNAR CONTRATA",null,null,null,null,null,null,null,null,"Tesur","Prio 1",{"$error":"#N/A"},"JS040",{"$error":"#N/A"},{"$f":"Pendientes!$Q30-Pendientes!$B30","v":-43587},{"$f":"VLOOKUP(Pendientes!$AC30,Hoja1!A:B,2,TRUE)","v":{"$error":"#N/A"}}]
{"$rows_left_out":713}
{"sheet":"Hoja1","index":2,"n_rows":10,"n_cols":2,"rows_kept":10,"cut":false,"hidden":true,"merged":[]}
[0,"en 24hs"]
[1,"en 24hs"]
[2,"en 24hs"]
[2,"Entre 24 y 72Hs"]
[3,"Entre 24 y 72Hs"]
[3,"Entre 3 y 5 dias"]
[5,"Entre 3 y 5 dias"]
[5,"Entre 5 y 10 dias"]
[10,"Entre 5 y 10 dias"]
[10,"Mas de 10 días"]

{"sheet":"Tablas dinamicas","index":3,"n_rows":17,"n_cols":14,"rows_kept":17,"cut":false,"hidden":false,"merged":[]}
["Etiquetas de fila","Cuenta de NODO",null,"ESTADO ","(Varios elementos)",null,"ESTADO ","(Varios elementos)",null,"ESTADO ","(Varios elementos)"]
["FIN",524,null,null,null,null,null,null,null,null,null,null,"FECHA_DE_INGRESO","(Varios elementos)"]
["FIN-A",54,null,"Cuenta de FECHA_FIN",null,null,"Etiquetas de fila","Cuenta de NODO",null,"Etiquetas de fila","Cuenta de NODO",null,"ESTADO ","(Varios elementos)"]
["Total general",578,null,576,null,null,"<4/2/2019 o (en blanco)",3,null,"Sidaco",198]
[null,null,null,null,null,null,"18/2/2019 - 24/2/2019",3,null,"CIS SRL",136,null,"Etiquetas de fila","Cuenta de NODO"]
[null,null,null,null,null,null,"4/3/2019 - 10/3/2019",6,null,"Guzmán Nacich",66,null,"en 24hs",89]
[null,null,null,null,null,null,"11/3/2019 - 17/3/2019",42,null,"Huawei",52,null,"Entre 24 y 72Hs",1]
[null,null,null,null,null,null,"18/3/2019 - 24/3/2019",28,null,"PEM",57,null,"Entre 3 y 5 dias",40]
[null,null,null,null,null,null,"25/3/2019 - 31/3/2019",62,null,"Multiradio",37,null,"Entre 5 y 10 dias",68]
[null,null,null,null,null,null,"1/4/2019 - 7/4/2019",63,null,"Ericsson",22,null,"Mas de 10 días",31]
[null,null,null,null,null,null,"8/4/2019 - 14/4/2019",86,null,"Tesur",5,null,"Total general",229]
[null,null,null,null,null,null,"15/4/2019 - 21/4/2019",13,null,"Telxius",5]
[null,null,null,null,null,null,"22/4/2019 - 28/4/2019",45,null,"Total general",578]
[null,null,null,null,null,null,"29/4/2019 - 5/5/2019",85]
[null,null,null,null,null,null,"6/5/2019 - 12/5/2019",126]
[null,null,null,null,null,null,"13/5/2019 - 15/5/2019",17]
[null,null,null,null,null,null,"Total general",579]

{"sheet":"Dashboard","index":4,"n_rows":15,"n_cols":11,"rows_kept":15,"cut":false,"hidden":false,"merged":[]}
[]
["Total de sitios con Solpe",{"$f":"GETPIVOTDATA(\"FECHA_FIN\",'Tablas dinamicas'!$D$3)","v":576},null,null,"Top por semana","Cantidad","Grafico",null,"Top Contratista","Cantidad","Grafico"]
[null,null,null,null,{"$f":"'Tablas dinamicas'!G4","v":"<4/2/2019 o (en blanco)"},{"$f":"GETPIVOTDATA(\"NODO\",'Tablas dinamicas'!$G$3,\"FECHA_FIN\",E3)","v":3},{"$f":"REPT(\"|\",F3/MAX($F$3:$F$12)*100)","v":"|||"},null,{"$f":"'Tablas dinamicas'!J4","v":"Sidaco"},{"$f":"GETPIVOTDATA(\"NODO\",'Tablas dinamicas'!$J$3,\"Contratista\",I3)","v":198},{"$f":"REPT(\"|\",J3/MAX($J$3:$J$12)*100)","v":"||||||||||||||||||||||||||||||||||||||||||||||||||||||||||||||||||||||||||||||||||||||||||||||||||||"}]
[null,null,null,null,{"$f":"'Tablas dinamicas'!G5","v":"18/2/2019 - 24/2/2019"},{"$f":"GETPIVOTDATA(\"NODO\",'Tablas dinamicas'!$G$3,\"FECHA_FIN\",E4)","v":3},{"$f":"REPT(\"|\",F4/MAX($F$3:$F$12)*100)","v":"|||"},null,{"$f":"'Tablas dinamicas'!J5","v":"CIS SRL"},{"$f":"GETPIVOTDATA(\"NODO\",'Tablas dinamicas'!$J$3,\"Contratista\",I4)","v":136},{"$f":"REPT(\"|\",J4/MAX($J$3:$J$12)*100)","v":"||||||||||||||||||||||||||||||||||||||||||||||||||||||||||||||||||||"}]
[null,null,null,null,{"$f":"'Tablas dinamicas'!G6","v":"4/3/2019 - 10/3/2019"},{"$f":"GETPIVOTDATA(\"NODO\",'Tablas dinamicas'!$G$3,\"FECHA_FIN\",E5)","v":6},"||||||",null,{"$f":"'Tablas dinamicas'!J6","v":"Guzmán Nacich"},{"$f":"GETPIVOTDATA(\"NODO\",'Tablas dinamicas'!$J$3,\"Contratista\",I5)","v":66},"|||||||||||||||||||||||||||||||||"]
[null,null,null,null,{"$f":"'Tablas dinamicas'!G7","v":"11/3/2019 - 17/3/2019"},{"$f":"GETPIVOTDATA(\"NODO\",'Tablas dinamicas'!$G$3,\"FECHA_FIN\",E6)","v":42},"||||||||||||||||||||||||||||||||||||||||||||||||",null,{"$f":"'Tablas dinamicas'!J7","v":"Huawei"},{"$f":"GETPIVOTDATA(\"NODO\",'Tablas dinamicas'!$J$3,\"Contratista\",I6)","v":52},"||||||||||||||||||||||||||"]
[null,null,null,null,{"$f":"'Tablas dinamicas'!G8","v":"18/3/2019 - 24/3/2019"},{"$f":"GETPIVOTDATA(\"NODO\",'Tablas dinamicas'!$G$3,\"FECHA_FIN\",E7)","v":28},"||||||||||||||||||||||||||||||||",null,{"$f":"'Tablas dinamicas'!J8","v":"PEM"},{"$f":"GETPIVOTDATA(\"NODO\",'Tablas dinamicas'!$J$3,\"Contratista\",I7)","v":57},"||||||||||||||||||||||||||||"]
[null,null,null,null,{"$f":"'Tablas dinamicas'!G9","v":"25/3/2019 - 31/3/2019"},{"$f":"GETPIVOTDATA(\"NODO\",'Tablas dinamicas'!$G$3,\"FECHA_FIN\",E8)","v":62},"||||||||||||||||||||||||||||||||||||||||||||||||||||||||||||||||||||||||",null,{"$f":"'Tablas dinamicas'!J9","v":"Multiradio"},{"$f":"GETPIVOTDATA(\"NODO\",'Tablas dinamicas'!$J$3,\"Contratista\",I8)","v":37},"||||||||||||||||||"]
[null,null,null,null,{"$f":"'Tablas dinamicas'!G10","v":"1/4/2019 - 7/4/2019"},{"$f":"GETPIVOTDATA(\"NODO\",'Tablas dinamicas'!$G$3,\"FECHA_FIN\",E9)","v":63},"|||||||||||||||||||||||||||||||||||||||||||||||||||||||||||||||||||||||||",null,{"$f":"'Tablas dinamicas'!J10","v":"Ericsson"},{"$f":"GETPIVOTDATA(\"NODO\",'Tablas dinamicas'!$J$3,\"Contratista\",I9)","v":22},"|||||||||||"]
[null,null,null,null,{"$f":"'Tablas dinamicas'!G11","v":"8/4/2019 - 14/4/2019"},{"$f":"GETPIVOTDATA(\"NODO\",'Tablas dinamicas'!$G$3,\"FECHA_FIN\",E10)","v":86},"||||||||||||||||||||||||||||||||||||||||||||||||||||||||||||||||||||||||||||||||||||||||||||||||||||",null,{"$f":"'Tablas dinamicas'!J11","v":"Tesur"},{"$f":"GETPIVOTDATA(\"NODO\",'Tablas dinamicas'!$J$3,\"Contratista\",I10)","v":5},"||"]
[null,null,null,null,{"$f":"'Tablas dinamicas'!G12","v":"15/4/2019 - 21/4/2019"},{"$f":"GETPIVOTDATA(\"NODO\",'Tablas dinamicas'!$G$3,\"FECHA_FIN\",E11)","v":13},"|||||||||||||||",null,{"$f":"'Tablas dinamicas'!J12","v":"Telxius"},{"$f":"GETPIVOTDATA(\"NODO\",'Tablas dinamicas'!$J$3,\"Contratista\",I11)","v":5},"||"]
[null,null,null,null,{"$f":"'Tablas dinamicas'!G13","v":"22/4/2019 - 28/4/2019"},{"$f":"GETPIVOTDATA(\"NODO\",'Tablas dinamicas'!$G$3,\"FECHA_FIN\",E12)","v":45},"||||||||||||||||||||||||||||||||||||||||||||||||||||"]
[null,null,null,null,{"$f":"'Tablas dinamicas'!G14","v":"29/4/2019 - 5/5/2019"},{"$f":"GETPIVOTDATA(\"NODO\",'Tablas dinamicas'!$G$3,\"FECHA_FIN\",E13)","v":85},{"$f":"REPT(\"|\",F13/MAX($F$3:$F$12)*100)","v":"||||||||||||||||||||||||||||||||||||||||||||||||||||||||||||||||||||||||||||||||||||||||||||||||||"}]
[null,null,null,null,{"$f":"'Tablas dinamicas'!G15","v":"6/5/2019 - 12/5/2019"},{"$f":"GETPIVOTDATA(\"NODO\",'Tablas dinamicas'!$G$3,\"FECHA_FIN\",E14)","v":126},{"$f":"REPT(\"|\",F14/MAX($F$3:$F$12)*100)","v":"||||||||||||||||||||||||||||||||||||||||||||||||||||||||||||||||||||||||||||||||||||||||||||||||||||||||||||||||||||||||||||||||||||||||||||||||||"}]
[null,null,null,null,{"$f":"'Tablas dinamicas'!G16","v":"13/5/2019 - 15/5/2019"},{"$f":"GETPIVOTDATA(\"NODO\",'Tablas dinamicas'!$G$3,\"FECHA_FIN\",E15)","v":17},{"$f":"REPT(\"|\",F15/MAX($F$3:$F$12)*100)","v":"|||||||||||||||||||"}]

{"sheet":"Hoja3","index":5,"n_rows":17,"n_cols":8,"rows_kept":17,"cut":false,"hidden":true,"merged":[]}
[]
[]
[]
[]
[]
[]
[null,null,null,null,null,"Sitio","Nodo"]
[null,null,null,null,null,"BS043","OBS043","ASI4517R3v06"]
[null,null,null,null,null,"BS104","OBS104","ASI4517R3v06"]
[null,null,null,null,null,"BS195","OBS195","ASI4517R3v06"]
[null,null,null,null,null,"CN266","OCN266","ASI4517R3v06"]
[null,null,null,null,null,"KN073","OKN073",{"$f":"VLOOKUP(G12,Pendientes!A:N,14,0)","v":"10/05 DWG cargado en asignación Tesur Estructura verificada - a verificar estructura por cambio de antena AIR32 x HEXA"}]
[null,null,null,null,null,"KO024","OKO024","ASI4517R3v06"]
[null,null,null,null,null,"KS050","NKS050",{"$f":"VLOOKUP(G14,Pendientes!A:N,14,0)","v":"a verificar estructura por cambio de antena AIR32 x HEXA"}]
[null,null,null,null,null,"KS050","OKS050",{"$f":"VLOOKUP(G15,Pendientes!A:N,14,0)","v":"a verificar estructura por cambio de antena AIR32 x HEXA"}]
[null,null,null,null,null,"KS457","MKS457","ASI4517R3v06"]
[null,null,null,null,null,"KS457","OKS457","ASI4517R3v06"]

{"sheet":"Combos","index":6,"n_rows":14,"n_cols":21,"rows_kept":14,"cut":false,"hidden":true,"merged":[]}
["NODO","FECHA_DE_INGRESO","PROPIETARIO","PRIORIDAD","DWG_BPM","DWG_MAIL","DWG_IU","MATERIALES_BPM","MATERIALES_MAIL","MATERIALES_IU","FUERZA_BPM","FUERZA_MAIL","FUERZA_IU","OBSERVACIONES_INGRESO","ESTADO","SOLPE_FUEGO","FECHA_FIN","HORAS_ESTIMADAS","OBSERVACIONES_FINALES","ANTENA_TIPO","ENERGIA"]
[null,null,"Barbara","Adelanto","Incompleto","Incompleto","Incompleto","Incompleto","Incompleto","Incompleto","Incompleto","Incompleto","Incompleto",null,"A REASIGNAR CONTRATA"]
[null,null,"CarolinaH","Alta","No","No","No","No","No","No","No","No","No",null,"DOING"]
[null,null,"CarolinaL","Baja","Si","Si","Si","Si","Si","Si","Si","Si","Si",null,"FIN"]
[null,null,"Cristian","Media",null,null,null,null,null,null,null,null,null,null,"FIN-A"]
[null,null,"Lucrecia",null,null,null,null,null,null,null,null,null,null,null,"PENDIENTE ENERGIA"]
[null,null,"Noelia",null,null,null,null,null,null,null,null,null,null,null,"PENDIENTE INGENIERIA "]
[null,null,"Ricky",null,null,null,null,null,null,null,null,null,null,null,"PENDIENTE INGENIERIA + ENERGIA"]
[null,null,"Rodrigo",null,null,null,null,null,null,null,null,null,null,null,"PENDIENTE RDA"]
[null,null,null,null,null,null,null,null,null,null,null,null,null,null,"SIN DATOS"]
[null,null,null,null,null,null,null,null,null,null,null,null,null,null,"SIN STOCK"]
[null,null,null,null,null,null,null,null,null,null,null,null,null,null,"SITIOS"]
[null,null,null,null,null,null,null,null,null,null,null,null,null,null,"STOP"]
[null,null,null,null,null,null,null,null,null,null,null,null,null,null,"TO DO"]