{"text_format":"1","workbook":"xlsx","n_sheets":8,"sheets":["Hoja1","Hoja2","Hoja3","Hoja4","Hoja5","Hoja6","RESUMEN","BASE DE DATOS"],"not_rendered":{"charts":0,"images":0,"macros":0,"external_links":0,"defined_names":6,"comments":0,"pivot_tables":0},"unopened":[],"bounds":{"document_bytes":16777216,"sheet_cells":100000,"rows_first":2000,"rows_last":500,"rows_between":2000,"halvings":0,"cell_chars":16384,"cell_head_chars":4096},"cells_cut":0,"cells_raw":0,"read":"whole","date_system":"1900"}

{"sheet":"Hoja1","index":0,"n_rows":44,"n_cols":5,"rows_kept":44,"cut":false,"hidden":false,"merged":[]}
[]
[]
["LBRO","HOJA","Nº","2016/17","2017/18"]
["LBRO","HOJA","Nº","2016/17","2017/18"]
[]
["LIBRO 1","HOJA 1",2,12,4]
["LIBRO 2","HOJA 1",3,12,4]
["LIBRO 3","HOJA 2",3,7,9]
["LIBRO 3","HOJA 3",3,7,7]
["LIBRO 4","HOJA 4",3,12,10]
["LIBRO 4","HOJA 5",3,13,6]
["LIBRO 4","HOJA 6",3,12,7]
["LIBRO 4","HOJA 7",3,11,6]
["LIBRO 4","HOJA 8",3,13,8]
["LIBRO 4","HOJA 9",3,11,6]
["LIBRO 4","HOJA 10",3,12,9]
["LIBRO 4","HOJA 11",3,12,8]
["LIBRO 5","HOJA 5",7,7,3]
["LIBRO 5","HOJA 6",7,10,3]
["LIBRO 5","HOJA 7",8,10,3]
{"$rows_left_out":25}
{"sheet":"Hoja2","index":1,"n_rows":44,"n_cols":5,"rows_kept":44,"cut":false,"hidden":false,"merged":[]}
[]
[]
["LBRO","HOJA","Nº","2016/17","2017/18"]
["LBRO","HOJA","Nº","2016/17","2017/18"]
[]
["LIBRO 1","HOJA 1",2,12,4]
["LIBRO 2","HOJA 1",3,12,4]
["LIBRO 3","HOJA 2",3,7,9]
["LIBRO 3","HOJA 3",3,7,7]
["LIBRO 4","HOJA 4",3,12,10]
["LIBRO 4","HOJA 5",3,13,6]
["LIBRO 4","HOJA 6",3,12,7]
["LIBRO 4","HOJA 7",3,11,6]
["LIBRO 4","HOJA 8",3,13,8]
["LIBRO 4","HOJA 9",3,11,6]
["LIBRO 4","HOJA 10",3,12,9]
["LIBRO 4","HOJA 11",3,12,8]
["LIBRO 5","HOJA 5",7,7,3]
["LIBRO 5","HOJA 6",7,10,3]
["LIBRO 5","HOJA 7",8,10,3]
{"$rows_left_out":25}
{"sheet":"Hoja3","index":2,"n_rows":36,"n_cols":5,"rows_kept":36,"cut":false,"hidden":false,"merged":[]}
[]
[]
["LBRO","HOJA","Nº","2016/17","2017/18"]
["LBRO","HOJA","Nº","2016/17","2017/18"]
[]
["LIBRO 1","HOJA 1",2,12,4]
["LIBRO 2","HOJA 1",3,12,4]
["LIBRO 3","HOJA 2",3,7,9]
["LIBRO 3","HOJA 3",3,7,7]
["LIBRO 4","HOJA 4",3,12,10]
["LIBRO 4","HOJA 5",3,13,6]
["LIBRO 4","HOJA 6",3,12,7]
["LIBRO 4","HOJA 7",3,11,6]
["LIBRO 4","HOJA 8",3,13,8]
["LIBRO 4","HOJA 9",3,11,6]
["LIBRO 4","HOJA 10",3,12,9]
["LIBRO 4","HOJA 11",3,12,8]
["LIBRO 5","HOJA 6",7,10,3]
["LIBRO 5","HOJA 7",8,10,3]
["LIBRO 5","HOJA 8",7,10,1]
{"$rows_left_out":17}
{"sheet":"Hoja4","index":3,"n_rows":41,"n_cols":5,"rows_kept":41,"cut":false,"hidden":false,"merged":[]}
[]
[]
["LBRO","HOJA","Nº","2016/17","2017/18"]
["LBRO","HOJA","Nº","2016/17","2017/18"]
[]
["LIBRO 4","HOJA 3",3,8,5]
["LIBRO 4","HOJA 4",3,12,10]
["LIBRO 4","HOJA 5",3,13,6]
["LIBRO 4","HOJA 6",3,12,7]
["LIBRO 4","HOJA 7",3,11,6]
["LIBRO 4","HOJA 8",3,13,8]
["LIBRO 4","HOJA 9",3,11,6]
["LIBRO 4","HOJA 10",3,12,9]
["LIBRO 4","HOJA 11",3,12,8]
["LIBRO 5","HOJA 1",3,2,2]
["LIBRO 5","HOJA 2",3,3,2]
["LIBRO 5","HOJA 3",7,8,6]
["LIBRO 5","HOJA 4",7,8,6]
["LIBRO 5","HOJA 5",7,7,3]
["LIBRO 5","HOJA 6",7,10,3]
{"$rows_left_out":22}
{"sheet":"Hoja5","index":4,"n_rows":28,"n_cols":5,"rows_kept":28,"cut":false,"hidden":false,"merged":[]}
[]
[]
["LBRO","HOJA","Nº","2016/17","2017/18"]
["LBRO","HOJA","Nº","2016/17","2017/18"]
[]
["LIBRO 1","HOJA 1",2,12,4]
["LIBRO 4","HOJA 2",3,8,4]
["LIBRO 4","HOJA 3",3,8,5]
["LIBRO 4","HOJA 4",3,12,10]
["LIBRO 4","HOJA 5",3,13,6]
["LIBRO 4","HOJA 6",3,12,7]
["LIBRO 4","HOJA 7",3,11,6]
["LIBRO 4","HOJA 8",3,13,8]
["LIBRO 5","HOJA 5",7,7,3]
["LIBRO 5","HOJA 6",7,10,3]
["LIBRO 5","HOJA 7",8,10,3]
["LIBRO 5","HOJA 8",7,10,1]
["LIBRO 5","HOJA 9",8,10,1]
["LIBRO 6","HOJA 1",2,8,4]
["LIBRO 6","HOJA 2",3,7,6]
{"$rows_left_out":9}
{"sheet":"Hoja6","index":5,"n_rows":21,"n_cols":5,"rows_kept":21,"cut":false,"hidden":false,"merged":[]}
[]
[]
["LBRO","HOJA","Nº","2016/17","2017/18"]
["LBRO","HOJA","Nº","2016/17","2017/18"]
[]
["LIBRO 1","HOJA 1",2,12,4]
["LIBRO 2","HOJA 1",3,12,4]
["LIBRO 5","HOJA 1",3,2,2]
["LIBRO 5","HOJA 2",3,3,2]
["LIBRO 5","HOJA 3",7,8,6]
["LIBRO 5","HOJA 4",7,8,6]
["LIBRO 5","HOJA 5",7,7,3]
["LIBRO 5","HOJA 6",7,10,3]
["LIBRO 7","HOJA 1",5,5,5]
["LIBRO 7","HOJA 2",5,12,5]
["LIBRO 7","HOJA 3",5,8,3]
["LIBRO 7","HOJA 4",5,8,4]
["LIBRO 8","HOJA 2",5,8,5]
["LIBRO 8","HOJA 3",5,7,5]
["LIBRO 8","HOJA 4",5,8,4]
{"$rows_left_out":2}
{"sheet":"RESUMEN","index":6,"n_rows":53,"n_cols":9,"rows_kept":53,"cut":false,"hidden":false,"merged":[]}
[]
[null,null,null,"HOJA","HOJA","HOJA","HOJA","HOJA","HOJA"]
[null,null,null,1,2,3,4,5,6]
["LBRO","HOJA","Nº","COINCIDENCIA HOJA","COINCIDENCIA HOJA","COINCIDENCIA HOJA","COINCIDENCIA HOJA","COINCIDENCIA HOJA","COINCIDENCIA HOJA"]
[]
[{"$f":"INDEX(Hoja1!$A$6:$C$100&Hoja2!$A$6:$C$100&Hoja3!$A$6:$C$100&Hoja4!$A$6:$A$100&Hoja5!$A$6:$C$100&Hoja6!$A$6:$C$100,MATCH('BASE DE DATOS'!A6&'BASE DE DATOS'!B6&'BASE DE DATOS'!C6,'BASE DE DATOS'!$A$6:$A$100),0)","v":"LIBRO 1LIBRO 1LIBRO 1LIBRO 4LIBRO 1LIBRO 1"},"HOJA 1",2,{"$f":"IFERROR(INDEX(Hoja1!$A$6:$C$100,MATCH('BASE DE DATOS'!A6&'BASE DE DATOS'!B6&'BASE DE DATOS'!C6,'BASE DE DATOS'!$A$6:$A$100),0),\"\")","v":"LIBRO 1"},{"$f":"IFERROR(INDEX(Hoja2!$A$6:$C$100,MATCH('BASE DE DATOS'!A6&'BASE DE DATOS'!B6&'BASE DE DATOS'!C6,'BASE DE DATOS'!$A$6:$A$100),0),\"\")","v":"LIBRO 1"},{"$f":"IFERROR(INDEX(Hoja3!$A$6:$C$100,MATCH('BASE DE DATOS'!A6&'BASE DE DATOS'!B6&'BASE DE DATOS'!C6,'BASE DE DATOS'!$A$6:$A$100),0),\"\")","v":"LIBRO 1"},{"$f":"IFERROR(INDEX(Hoja4!$A$6:$C$100,MATCH('BASE DE DATOS'!A6&'BASE DE DATOS'!B6&'BASE DE DATOS'!C6,'BASE DE DATOS'!$A$6:$A$100),0),\"\")","v":"LIBRO 4"},{"$f":"IFERROR(INDEX(Hoja5!$A$6:$C$100,MATCH('BASE DE DATOS'!A6&'BASE DE DATOS'!B6&'BASE DE DATOS'!C6,'BASE DE DATOS'!$A$6:$A$100),0),\"\")","v":"LIBRO 1"},{"$f":"IFERROR(INDEX(Hoja6!$A$6:$C$100,MATCH('BASE DE DATOS'!A6&'BASE DE DATOS'!B6&'BASE DE DATOS'!C6,'BASE DE DATOS'!$A$6:$A$100),0),\"\")","v":"LIBRO 1"}]
[{"$f":"INDEX(Hoja1!$A$6:$C$100&Hoja2!$A$6:$C$100&Hoja3!$A$6:$C$100&Hoja4!A7:A100&Hoja5!$A$6:$C$100&Hoja6!$A$6:$C$100,MATCH('BASE DE DATOS'!A7&'BASE DE DATOS'!B7&'BASE DE DATOS'!C7,'BASE DE DATOS'!$A$6:$A$100),0)","v":"LIBRO 2LIBRO 2LIBRO 2LIBRO 4LIBRO 4LIBRO 2"},null,null,{"$f":"IFERROR(INDEX(Hoja1!$A$6:$C$100,MATCH('BASE DE DATOS'!A7&'BASE DE DATOS'!B7&'BASE DE DATOS'!C7,'BASE DE DATOS'!$A$6:$A$100),0),\"\")","v":"LIBRO 2"},{"$f":"IFERROR(INDEX(Hoja2!$A$6:$C$100,MATCH('BASE DE DATOS'!A7&'BASE DE DATOS'!B7&'BASE DE DATOS'!C7,'BASE DE DATOS'!$A$6:$A$100),0),\"\")","v":"LIBRO 2"},{"$f":"IFERROR(INDEX(Hoja3!$A$6:$C$100,MATCH('BASE DE DATOS'!A7&'BASE DE DATOS'!B7&'BASE DE DATOS'!C7,'BASE DE DATOS'!$A$6:$A$100),0),\"\")","v":"LIBRO 2"},{"$f":"IFERROR(INDEX(Hoja4!$A$6:$C$100,MATCH('BASE DE DATOS'!A7&'BASE DE DATOS'!B7&'BASE DE DATOS'!C7,'BASE DE DATOS'!$A$6:$A$100),0),\"\")","v":"LIBRO 4"},{"$f":"IFERROR(INDEX(Hoja5!$A$6:$C$100,MATCH('BASE DE DATOS'!A7&'BASE DE DATOS'!B7&'BASE DE DATOS'!C7,'BASE DE DATOS'!$A$6:$A$100),0),\"\")","v":"LIBRO 4"},{"$f":"IFERROR(INDEX(Hoja6!$A$6:$C$100,MATCH('BASE DE DATOS'!A7&'BASE DE DATOS'!B7&'BASE DE DATOS'!C7,'BASE DE DATOS'!$A$6:$A$100),0),\"\")","v":"LIBRO 2"}]
[{"$f":"INDEX(Hoja1!$A$6:$C$100&Hoja2!$A$6:$C$100&Hoja3!$A$6:$C$100&Hoja4!A8:A101&Hoja5!$A$6:$C$100&Hoja6!$A$6:$C$100,MATCH('BASE DE DATOS'!A7,'BASE DE DATOS'!$A$6:$C$100),0)","v":{"$error":"#N/A"}},null,null,{"$f":"IFERROR(INDEX(Hoja1!$A$6:$C$100,MATCH('BASE DE DATOS'!A8&'BASE DE DATOS'!B8&'BASE DE DATOS'!C8,'BASE DE DATOS'!$A$6:$A$100),0),\"\")","v":"LIBRO 3"},{"$f":"IFERROR(INDEX(Hoja2!$A$6:$C$100,MATCH('BASE DE DATOS'!A8&'BASE DE DATOS'!B8&'BASE DE DATOS'!C8,'BASE DE DATOS'!$A$6:$A$100),0),\"\")","v":"LIBRO 3"},{"$f":"IFERROR(INDEX(Hoja3!$A$6:$C$100,MATCH('BASE DE DATOS'!A8&'BASE DE DATOS'!B8&'BASE DE DATOS'!C8,'BASE DE DATOS'!$A$6:$A$100),0),\"\")","v":"LIBRO 3"},{"$f":"IFERROR(INDEX(Hoja4!$A$6:$C$100,MATCH('BASE DE DATOS'!A8&'BASE DE DATOS'!B8&'BASE DE DATOS'!C8,'BASE DE DATOS'!$A$6:$A$100),0),\"\")","v":"LIBRO 4"},{"$f":"IFERROR(INDEX(Hoja5!$A$6:$C$100,MATCH('BASE DE DATOS'!A8&'BASE DE DATOS'!B8&'BASE DE DATOS'!C8,'BASE DE DATOS'!$A$6:$A$100),0),\"\")","v":"LIBRO 4"},{"$f":"IFERROR(INDEX(Hoja6!$A$6:$C$100,MATCH('BASE DE DATOS'!A8&'BASE DE DATOS'!B8&'BASE DE DATOS'!C8,'BASE DE DATOS'!$A$6:$A$100),0),\"\")","v":"LIBRO 5"}]
[{"$f":"INDEX(Hoja1!$A$6:$C$100&Hoja2!$A$6:$C$100&Hoja3!$A$6:$C$100&Hoja4!A9:A102&Hoja5!$A$6:$C$100&Hoja6!$A$6:$C$100,MATCH('BASE DE DATOS'!A8,'BASE DE DATOS'!$A$6:$C$100),0)","v":{"$error":"#N/A"}},null,null,{"$f":"IFERROR(INDEX(Hoja1!$A$6:$C$100,MATCH('BASE DE DATOS'!A9&'BASE DE DATOS'!B9&'BASE DE DATOS'!C9,'BASE DE DATOS'!$A$6:$A$100),0),\"\")","v":"LIBRO 3"},{"$f":"IFERROR(INDEX(Hoja2!$A$6:$C$100,MATCH('BASE DE DATOS'!A9&'BASE DE DATOS'!B9&'BASE DE DATOS'!C9,'BASE DE DATOS'!$A$6:$A$100),0),\"\")","v":"LIBRO 3"},{"$f":"IFERROR(INDEX(Hoja3!$A$6:$C$100,MATCH('BASE DE DATOS'!A9&'BASE DE DATOS'!B9&'BASE DE DATOS'!C9,'BASE DE DATOS'!$A$6:$A$100),0),\"\")","v":"LIBRO 3"},{"$f":"IFERROR(INDEX(Hoja4!$A$6:$C$100,MATCH('BASE DE DATOS'!A9&'BASE DE DATOS'!B9&'BASE DE DATOS'!C9,'BASE DE DATOS'!$A$6:$A$100),0),\"\")","v":"LIBRO 4"},{"$f":"IFERROR(INDEX(Hoja5!$A$6:$C$100,MATCH('BASE DE DATOS'!A9&'BASE DE DATOS'!B9&'BASE DE DATOS'!C9,'BASE DE DATOS'!$A$6:$A$100),0),\"\")","v":"LIBRO 4"},{"$f":"IFERROR(INDEX(Hoja6!$A$6:$C$100,MATCH('BASE DE DATOS'!A9&'BASE DE DATOS'!B9&'BASE DE DATOS'!C9,'BASE DE DATOS'!$A$6:$A$100),0),\"\")","v":"LIBRO 5"}]
[{"$f":"INDEX(Hoja1!$A$6:$C$100&Hoja2!$A$6:$C$100&Hoja3!$A$6:$C$100&Hoja4!A10:A103&Hoja5!$A$6:$C$100&Hoja6!$A$6:$C$100,MATCH('BASE DE DATOS'!A9,'BASE DE DATOS'!$A$6:$C$100),0)","v":{"$error":"#N/A"}},null,null,{"$f":"IFERROR(INDEX(Hoja1!$A$6:$C$100,MATCH('BASE DE DATOS'!A10&'BASE DE DATOS'!B10&'BASE DE DATOS'!C10,'BASE DE DATOS'!$A$6:$A$100),0),\"\")","v":"LIBRO 4"},{"$f":"IFERROR(INDEX(Hoja2!$A$6:$C$100,MATCH('BASE DE DATOS'!A10&'BASE DE DATOS'!B10&'BASE DE DATOS'!C10,'BASE DE DATOS'!$A$6:$A$100),0),\"\")","v":"LIBRO 4"},{"$f":"IFERROR(INDEX(Hoja3!$A$6:$C$100,MATCH('BASE DE DATOS'!A10&'BASE DE DATOS'!B10&'BASE DE DATOS'!C10,'BASE DE DATOS'!$A$6:$A$100),0),\"\")","v":"LIBRO 4"},{"$f":"IFERROR(INDEX(Hoja4!$A$6:$C$100,MATCH('BASE DE DATOS'!A10&'BASE DE DATOS'!B10&'BASE DE DATOS'!C10,'BASE DE DATOS'!$A$6:$A$100),0),\"\")","v":"LIBRO 5"},{"$f":"IFERROR(INDEX(Hoja5!$A$6:$C$100,MATCH('BASE DE DATOS'!A10&'BASE DE DATOS'!B10&'BASE DE DATOS'!C10,'BASE DE DATOS'!$A$6:$A$100),0),\"\")","v":"LIBRO 5"},{"$f":"IFERROR(INDEX(Hoja6!$A$6:$C$100,MATCH('BASE DE DATOS'!A10&'BASE DE DATOS'!B10&'BASE DE DATOS'!C10,'BASE DE DATOS'!$A$6:$A$100),0),\"\")","v":"LIBRO 7"}]
[{"$f":"INDEX(Hoja1!$A$6:$C$100&Hoja2!$A$6:$C$100&Hoja3!$A$6:$C$100&Hoja4!A11:A104&Hoja5!$A$6:$C$100&Hoja6!$A$6:$C$100,MATCH('BASE DE DATOS'!A10,'BASE DE DATOS'!$A$6:$C$100),0)","v":{"$error":"#N/A"}},null,null,{"$f":"IFERROR(INDEX(Hoja1!$A$6:$C$100,MATCH('BASE DE DATOS'!A11&'BASE DE DATOS'!B11&'BASE DE DATOS'!C11,'BASE DE DATOS'!$A$6:$A$100),0),\"\")","v":"LIBRO 4"},{"$f":"IFERROR(INDEX(Hoja2!$A$6:$C$100,MATCH('BASE DE DATOS'!A11&'BASE DE DATOS'!B11&'BASE DE DATOS'!C11,'BASE DE DATOS'!$A$6:$A$100),0),\"\")","v":"LIBRO 4"},{"$f":"IFERROR(INDEX(Hoja3!$A$6:$C$100,MATCH('BASE DE DATOS'!A11&'BASE DE DATOS'!B11&'BASE DE DATOS'!C11,'BASE DE DATOS'!$A$6:$A$100),0),\"\")","v":"LIBRO 4"},{"$f":"IFERROR(INDEX(Hoja4!$A$6:$C$100,MATCH('BASE DE DATOS'!A11&'BASE DE DATOS'!B11&'BASE DE DATOS'!C11,'BASE DE DATOS'!$A$6:$A$100),0),\"\")","v":"LIBRO 5"},{"$f":"IFERROR(INDEX(Hoja5!$A$6:$C$100,MATCH('BASE DE DATOS'!A11&'BASE DE DATOS'!B11&'BASE DE DATOS'!C11,'BASE DE DATOS'!$A$6:$A$100),0),\"\")","v":"LIBRO 5"},{"$f":"IFERROR(INDEX(Hoja6!$A$6:$C$100,MATCH('BASE DE DATOS'!A11&'BASE DE DATOS'!B11&'BASE DE DATOS'!C11,'BASE DE DATOS'!$A$6:$A$100),0),\"\")","v":"LIBRO 7"}]
[{"$f":"INDEX(Hoja1!$A$6:$C$100&Hoja2!$A$6:$C$100&Hoja3!$A$6:$C$100&Hoja4!A12:A105&Hoja5!$A$6:$C$100&Hoja6!$A$6:$C$100,MATCH('BASE DE DATOS'!A11,'BASE DE DATOS'!$A$6:$C$100),0)","v":{"$error":"#N/A"}},null,null,{"$f":"IFERROR(INDEX(Hoja1!$A$6:$C$100,MATCH('BASE DE DATOS'!A12&'BASE DE DATOS'!B12&'BASE DE DATOS'!C12,'BASE DE DATOS'!$A$6:$A$100),0),\"\")","v":"LIBRO 4"},{"$f":"IFERROR(INDEX(Hoja2!$A$6:$C$100,MATCH('BASE DE DATOS'!A12&'BASE DE DATOS'!B12&'BASE DE DATOS'!C12,'BASE DE DATOS'!$A$6:$A$100),0),\"\")","v":"LIBRO 4"},{"$f":"IFERROR(INDEX(Hoja3!$A$6:$C$100,MATCH('BASE DE DATOS'!A12&'BASE DE DATOS'!B12&'BASE DE DATOS'!C12,'BASE DE DATOS'!$A$6:$A$100),0),\"\")","v":"LIBRO 4"},{"$f":"IFERROR(INDEX(Hoja4!$A$6:$C$100,MATCH('BASE DE DATOS'!A12&'BASE DE DATOS'!B12&'BASE DE DATOS'!C12,'BASE DE DATOS'!$A$6:$A$100),0),\"\")","v":"LIBRO 5"},{"$f":"IFERROR(INDEX(Hoja5!$A$6:$C$100,MATCH('BASE DE DATOS'!A12&'BASE DE DATOS'!B12&'BASE DE DATOS'!C12,'BASE DE DATOS'!$A$6:$A$100),0),\"\")","v":"LIBRO 5"},{"$f":"IFERROR(INDEX(Hoja6!$A$6:$C$100,MATCH('BASE DE DATOS'!A12&'BASE DE DATOS'!B12&'BASE DE DATOS'!C12,'BASE DE DATOS'!$A$6:$A$100),0),\"\")","v":"LIBRO 7"}]
[null,null,null,{"$f":"IFERROR(INDEX(Hoja1!$A$6:$C$100,MATCH('BASE DE DATOS'!A13&'BASE DE DATOS'!B13&'BASE DE DATOS'!C13,'BASE DE DATOS'!$A$6:$A$100),0),\"\")","v":"LIBRO 4"},{"$f":"IFERROR(INDEX(Hoja2!$A$6:$C$100,MATCH('BASE DE DATOS'!A13&'BASE DE DATOS'!B13&'BASE DE DATOS'!C13,'BASE DE DATOS'!$A$6:$A$100),0),\"\")","v":"LIBRO 4"},{"$f":"IFERROR(INDEX(Hoja3!$A$6:$C$100,MATCH('BASE DE DATOS'!A13&'BASE DE DATOS'!B13&'BASE DE DATOS'!C13,'BASE DE DATOS'!$A$6:$A$100),0),\"\")","v":"LIBRO 4"},{"$f":"IFERROR(INDEX(Hoja4!$A$6:$C$100,MATCH('BASE DE DATOS'!A13&'BASE DE DATOS'!B13&'BASE DE DATOS'!C13,'BASE DE DATOS'!$A$6:$A$100),0),\"\")","v":"LIBRO 5"},{"$f":"IFERROR(INDEX(Hoja5!$A$6:$C$100,MATCH('BASE DE DATOS'!A13&'BASE DE DATOS'!B13&'BASE DE DATOS'!C13,'BASE DE DATOS'!$A$6:$A$100),0),\"\")","v":"LIBRO 5"},{"$f":"IFERROR(INDEX(Hoja6!$A$6:$C$100,MATCH('BASE DE DATOS'!A13&'BASE DE DATOS'!B13&'BASE DE DATOS'!C13,'BASE DE DATOS'!$A$6:$A$100),0),\"\")","v":"LIBRO 7"}]
[null,null,null,{"$f":"IFERROR(INDEX(Hoja1!$A$6:$C$100,MATCH('BASE DE DATOS'!A14&'BASE DE DATOS'!B14&'BASE DE DATOS'!C14,'BASE DE DATOS'!$A$6:$A$100),0),\"\")","v":"LIBRO 4"},{"$f":"IFERROR(INDEX(Hoja2!$A$6:$C$100,MATCH('BASE DE DATOS'!A14&'BASE DE DATOS'!B14&'BASE DE DATOS'!C14,'BASE DE DATOS'!$A$6:$A$100),0),\"\")","v":"LIBRO 4"},{"$f":"IFERROR(INDEX(Hoja3!$A$6:$C$100,MATCH('BASE DE DATOS'!A14&'BASE DE DATOS'!B14&'BASE DE DATOS'!C14,'BASE DE DATOS'!$A$6:$A$100),0),\"\")","v":"LIBRO 4"},{"$f":"IFERROR(INDEX(Hoja4!$A$6:$C$100,MATCH('BASE DE DATOS'!A14&'BASE DE DATOS'!B14&'BASE DE DATOS'!C14,'BASE DE DATOS'!$A$6:$A$100),0),\"\")","v":"LIBRO 5"},{"$f":"IFERROR(INDEX(Hoja5!$A$6:$C$100,MATCH('BASE DE DATOS'!A14&'BASE DE DATOS'!B14&'BASE DE DATOS'!C14,'BASE DE DATOS'!$A$6:$A$100),0),\"\")","v":"LIBRO 5"},{"$f":"IFERROR(INDEX(Hoja6!$A$6:$C$100,MATCH('BASE DE DATOS'!A14&'BASE DE DATOS'!B14&'BASE DE DATOS'!C14,'BASE DE DATOS'!$A$6:$A$100),0),\"\")","v":"LIBRO 7"}]
[null,null,null,{"$f":"IFERROR(INDEX(Hoja1!$A$6:$C$100,MATCH('BASE DE DATOS'!A15&'BASE DE DATOS'!B15&'BASE DE DATOS'!C15,'BASE DE DATOS'!$A$6:$A$100),0),\"\")","v":"LIBRO 4"},{"$f":"IFERROR(INDEX(Hoja2!$A$6:$C$100,MATCH('BASE DE DATOS'!A15&'BASE DE DATOS'!B15&'BASE DE DATOS'!C15,'BASE DE DATOS'!$A$6:$A$100),0),\"\")","v":"LIBRO 4"},{"$f":"IFERROR(INDEX(Hoja3!$A$6:$C$100,MATCH('BASE DE DATOS'!A15&'BASE DE DATOS'!B15&'BASE DE DATOS'!C15,'BASE DE DATOS'!$A$6:$A$100),0),\"\")","v":"LIBRO 4"},{"$f":"IFERROR(INDEX(Hoja4!$A$6:$C$100,MATCH('BASE DE DATOS'!A15&'BASE DE DATOS'!B15&'BASE DE DATOS'!C15,'BASE DE DATOS'!$A$6:$A$100),0),\"\")","v":"LIBRO 5"},{"$f":"IFERROR(INDEX(Hoja5!$A$6:$C$100,MATCH('BASE DE DATOS'!A15&'BASE DE DATOS'!B15&'BASE DE DATOS'!C15,'BASE DE DATOS'!$A$6:$A$100),0),\"\")","v":"LIBRO 5"},{"$f":"IFERROR(INDEX(Hoja6!$A$6:$C$100,MATCH('BASE DE DATOS'!A15&'BASE DE DATOS'!B15&'BASE DE DATOS'!C15,'BASE DE DATOS'!$A$6:$A$100),0),\"\")","v":"LIBRO 7"}]
[null,null,null,{"$f":"IFERROR(INDEX(Hoja1!$A$6:$C$100,MATCH('BASE DE DATOS'!A16&'BASE DE DATOS'!B16&'BASE DE DATOS'!C16,'BASE DE DATOS'!$A$6:$A$100),0),\"\")","v":"LIBRO 4"},{"$f":"IFERROR(INDEX(Hoja2!$A$6:$C$100,MATCH('BASE DE DATOS'!A16&'BASE DE DATOS'!B16&'BASE DE DATOS'!C16,'BASE DE DATOS'!$A$6:$A$100),0),\"\")","v":"LIBRO 4"},{"$f":"IFERROR(INDEX(Hoja3!$A$6:$C$100,MATCH('BASE DE DATOS'!A16&'BASE DE DATOS'!B16&'BASE DE DATOS'!C16,'BASE DE DATOS'!$A$6:$A$100),0),\"\")","v":"LIBRO 4"},{"$f":"IFERROR(INDEX(Hoja4!$A$6:$C$100,MATCH('BASE DE DATOS'!A16&'BASE DE DATOS'!B16&'BASE DE DATOS'!C16,'BASE DE DATOS'!$A$6:$A$100),0),\"\")","v":"LIBRO 5"},{"$f":"IFERROR(INDEX(Hoja5!$A$6:$C$100,MATCH('BASE DE DATOS'!A16&'BASE DE DATOS'!B16&'BASE DE DATOS'!C16,'BASE DE DATOS'!$A$6:$A$100),0),\"\")","v":"LIBRO 5"},{"$f":"IFERROR(INDEX(Hoja6!$A$6:$C$100,MATCH('BASE DE DATOS'!A16&'BASE DE DATOS'!B16&'BASE DE DATOS'!C16,'BASE DE DATOS'!$A$6:$A$100),0),\"\")","v":"LIBRO 7"}]
[null,null,null,{"$f":"IFERROR(INDEX(Hoja1!$A$6:$C$100,MATCH('BASE DE DATOS'!A17&'BASE DE DATOS'!B17&'BASE DE DATOS'!C17,'BASE DE DATOS'!$A$6:$A$100),0),\"\")","v":"LIBRO 4"},{"$f":"IFERROR(INDEX(Hoja2!$A$6:$C$100,MATCH('BASE DE DATOS'!A17&'BASE DE DATOS'!B17&'BASE DE DATOS'!C17,'BASE DE DATOS'!$A$6:$A$100),0),\"\")","v":"LIBRO 4"},{"$f":"IFERROR(INDEX(Hoja3!$A$6:$C$100,MATCH('BASE DE DATOS'!A17&'BASE DE DATOS'!B17&'BASE DE DATOS'!C17,'BASE DE DATOS'!$A$6:$A$100),0),\"\")","v":"LIBRO 4"},{"$f":"IFERROR(INDEX(Hoja4!$A$6:$C$100,MATCH('BASE DE DATOS'!A17&'BASE DE DATOS'!B17&'BASE DE DATOS'!C17,'BASE DE DATOS'!$A$6:$A$100),0),\"\")","v":"LIBRO 5"},{"$f":"IFERROR(INDEX(Hoja5!$A$6:$C$100,MATCH('BASE DE DATOS'!A17&'BASE DE DATOS'!B17&'BASE DE DATOS'!C17,'BASE DE DATOS'!$A$6:$A$100),0),\"\")","v":"LIBRO 5"},{"$f":"IFERROR(INDEX(Hoja6!$A$6:$C$100,MATCH('BASE DE DATOS'!A17&'BASE DE DATOS'!B17&'BASE DE DATOS'!C17,'BASE DE DATOS'!$A$6:$A$100),0),\"\")","v":"LIBRO 7"}]
[null,null,null,{"$f":"IFERROR(INDEX(Hoja1!$A$6:$C$100,MATCH('BASE DE DATOS'!A18&'BASE DE DATOS'!B18&'BASE DE DATOS'!C18,'BASE DE DATOS'!$A$6:$A$100),0),\"\")","v":"LIBRO 5"},{"$f":"IFERROR(INDEX(Hoja2!$A$6:$C$100,MATCH('BASE DE DATOS'!A18&'BASE DE DATOS'!B18&'BASE DE DATOS'!C18,'BASE DE DATOS'!$A$6:$A$100),0),\"\")","v":"LIBRO 5"},{"$f":"IFERROR(INDEX(Hoja3!$A$6:$C$100,MATCH('BASE DE DATOS'!A18&'BASE DE DATOS'!B18&'BASE DE DATOS'!C18,'BASE DE DATOS'!$A$6:$A$100),0),\"\")","v":"LIBRO 6"},{"$f":"IFERROR(INDEX(Hoja4!$A$6:$C$100,MATCH('BASE DE DATOS'!A18&'BASE DE DATOS'!B18&'BASE DE DATOS'!C18,'BASE DE DATOS'!$A$6:$A$100),0),\"\")","v":"LIBRO 5"},{"$f":"IFERROR(INDEX(Hoja5!$A$6:$C$100,MATCH('BASE DE DATOS'!A18&'BASE DE DATOS'!B18&'BASE DE DATOS'!C18,'BASE DE DATOS'!$A$6:$A$100),0),\"\")","v":"LIBRO 6"},{"$f":"IFERROR(INDEX(Hoja6!$A$6:$C$100,MATCH('BASE DE DATOS'!A18&'BASE DE DATOS'!B18&'BASE DE DATOS'!C18,'BASE DE DATOS'!$A$6:$A$100),0),\"\")","v":0}]
[null,null,null,{"$f":"IFERROR(INDEX(Hoja1!$A$6:$C$100,MATCH('BASE DE DATOS'!A19&'BASE DE DATOS'!B19&'BASE DE DATOS'!C19,'BASE DE DATOS'!$A$6:$A$100),0),\"\")","v":"LIBRO 5"},{"$f":"IFERROR(INDEX(Hoja2!$A$6:$C$100,MATCH('BASE DE DATOS'!A19&'BASE DE DATOS'!B19&'BASE DE DATOS'!C19,'BASE DE DATOS'!$A$6:$A$100),0),\"\")","v":"LIBRO 5"},{"$f":"IFERROR(INDEX(Hoja3!$A$6:$C$100,MATCH('BASE DE DATOS'!A19&'BASE DE DATOS'!B19&'BASE DE DATOS'!C19,'BASE DE DATOS'!$A$6:$A$100),0),\"\")","v":"LIBRO 6"},{"$f":"IFERROR(INDEX(Hoja4!$A$6:$C$100,MATCH('BASE DE DATOS'!A19&'BASE DE DATOS'!B19&'BASE DE DATOS'!C19,'BASE DE DATOS'!$A$6:$A$100),0),\"\")","v":"LIBRO 5"},{"$f":"IFERROR(INDEX(Hoja5!$A$6:$C$100,MATCH('BASE DE DATOS'!A19&'BASE DE DATOS'!B19&'BASE DE DATOS'!C19,'BASE DE DATOS'!$A$6:$A$100),0),\"\")","v":"LIBRO 6"},{"$f":"IFERROR(INDEX(Hoja6!$A$6:$C$100,MATCH('BASE DE DATOS'!A19&'BASE DE DATOS'!B19&'BASE DE DATOS'!C19,'BASE DE DATOS'!$A$6:$A$100),0),\"\")","v":0}]
[null,null,null,{"$f":"IFERROR(INDEX(Hoja1!$A$6:$C$100,MATCH('BASE DE DATOS'!A20&'BASE DE DATOS'!B20&'BASE DE DATOS'!C20,'BASE DE DATOS'!$A$6:$A$100),0),\"\")","v":"LIBRO 5"},{"$f":"IFERROR(INDEX(Hoja2!$A$6:$C$100,MATCH('BASE DE DATOS'!A20&'BASE DE DATOS'!B20&'BASE DE DATOS'!C20,'BASE DE DATOS'!$A$6:$A$100),0),\"\")","v":"LIBRO 5"},{"$f":"IFERROR(INDEX(Hoja3!$A$6:$C$100,MATCH('BASE DE DATOS'!A20&'BASE DE DATOS'!B20&'BASE DE DATOS'!C20,'BASE DE DATOS'!$A$6:$A$100),0),\"\")","v":"LIBRO 6"},{"$f":"IFERROR(INDEX(Hoja4!$A$6:$C$100,MATCH('BASE DE DATOS'!A20&'BASE DE DATOS'!B20&'BASE DE DATOS'!C20,'BASE DE DATOS'!$A$6:$A$100),0),\"\")","v":"LIBRO 5"},{"$f":"IFERROR(INDEX(Hoja5!$A$6:$C$100,MATCH('BASE DE DATOS'!A20&'BASE DE DATOS'!B20&'BASE DE DATOS'!C20,'BASE DE DATOS'!$A$6:$A$100),0),\"\")","v":"LIBRO 6"},{"$f":"IFERROR(INDEX(Hoja6!$A$6:$C$100,MATCH('BASE DE DATOS'!A20&'BASE DE DATOS'!B20&'BASE DE DATOS'!C20,'BASE DE DATOS'!$A$6:$A$100),0),\"\")","v":0}]
{"$rows_left_out":34}
{"sheet":"BASE DE DATOS","index":7,"n_rows":44,"n_cols":3,"rows_kept":44,"cut":false,"hidden":false,"merged":[]}
[]
[]
["LBRO","HOJA","Nº"]
["LBRO","HOJA","Nº"]
[]
["LIBRO 1","HOJA 1",2]
["LIBRO 2","HOJA 1",3]
["LIBRO 3","HOJA 2",3]
["LIBRO 3","HOJA 3",3]
["LIBRO 4","HOJA 4",3]
["LIBRO 4","HOJA 5",3]
["LIBRO 4","HOJA 6",3]
["LIBRO 4","HOJA 7",3]
["LIBRO 4","HOJA 8",3]
["LIBRO 4","HOJA 9",3]
["LIBRO 4","HOJA 10",3]
["LIBRO 4","HOJA 11",3]
["LIBRO 5","HOJA 5",7]
["LIBRO 5","HOJA 6",7]
["LIBRO 5","HOJA 7",8]
{"$rows_left_out":24}