{"text_format":"1","workbook":"xlsx","n_sheets":6,"sheets":["10","11","12","13","RESUMEN","BASE DE DATOS"],"not_rendered":{"charts":0,"images":0,"macros":1,"external_links":0,"defined_names":5,"comments":0,"pivot_tables":0},"unopened":[],"bounds":{"document_bytes":16777216,"sheet_cells":100000,"rows_first":2000,"rows_last":500,"rows_between":2000,"halvings":0,"cell_chars":16384,"cell_head_chars":4096},"cells_cut":0,"cells_raw":0,"read":"whole","date_system":"1900"}

{"sheet":"10","index":0,"n_rows":47,"n_cols":4,"rows_kept":47,"cut":false,"hidden":false,"merged":[]}
[]
[]
[10,"LBRO","HOJA","Nº"]
[10,"LBRO","HOJA","Nº"]
[]
[10,1," F T",2]
[10,5," F T",2]
[10,6," F B 5-1",7]
[10,6," F B 8-1",7]
[10,6," F B 1-1",8]
[10,6," F B 5-1",8]
[10,6," F T",2]
[10,7," F B 3-1",5]
[10,7," F B 5-1",5]
[10,7," F B 7-1",5]
[10,7," F T",3]
[10,8," F B 1-1",6]
[10,8," F B 6-1",6]
[10,8," F B 8-1",6]
[10]
[10]
[10]
[10]
[10]
[10]
[10]
[10]
[10]
[10]
[10]
{"$rows_left_out":18}
{"sheet":"11","index":1,"n_rows":57,"n_cols":4,"rows_kept":57,"cut":false,"hidden":false,"merged":[]}
[]
[]
[11,"LBRO","HOJA","Nº"]
[11,"LBRO","HOJA","Nº"]
[]
[11,1," F T",2]
[11,1," F T",3]
[11,5," F B 5-1",7]
[11,5," F B 1-1",8]
[11,5," F B 2-1",8]
[11,5," F B 5-1",8]
[11,5," F B 7-1",8]
[11,5," F B 8-1",8]
[11,6," F B 2-1",8]
[11,6," F B 7-1",8]
[11,6," F T",3]
[11,7," F B 1-1",5]
[11,7," F B 2-1",5]
[11,7," F B 3-1",5]
[11,7," F B 6-1",5]
[11,7," F B 8-1",5]
[11,7," F T",2]
[11,8," F T",2]
[11]
[11]
[11]
[11]
[11]
[11]
[11]
{"$rows_left_out":28}
{"sheet":"12","index":2,"n_rows":60,"n_cols":4,"rows_kept":60,"cut":false,"hidden":false,"merged":[]}
[]
[]
[12,"LBRO","HOJA","Nº"]
[12,"LBRO","HOJA","Nº"]
[]
[12,1," F T",2]
[12,5," F B 1-1",7]
[12,5," F B 4-1",7]
[12,5," F B 6-1",7]
[12,5," F B 7-1",7]
[12,5," F B 3-1",8]
[12,5," F B 4-1",8]
[12,5," F B 6-1",8]
[12,6," F B 1-1",7]
[12,6," F B 4-1",7]
[12,6," F B 6-1",7]
[12,6," F B 7-1",7]
[12,6," F B 3-1",8]
[12,6," F B 4-1",8]
[12,6," F B 6-1",8]
[12,6," F B 8-1",8]
[12,7," F B 6-1",5]
[12,7," F T",3]
[12,8," F T",3]
[12]
[12]
[12]
[12]
[12]
[12]
{"$rows_left_out":31}
{"sheet":"13","index":3,"n_rows":60,"n_cols":4,"rows_kept":60,"cut":false,"hidden":false,"merged":[]}
[]
[]
[13,"LBRO","HOJA","Nº"]
[13,"LBRO","HOJA","Nº"]
[]
[13,5," F B 1-1",8]
[13,5," F B 2-1",8]
[13,5," F B 5-1",8]
[13,5," F B 7-1",8]
[13,5," F T",2]
[13,6," F B 2-1",8]
[13,6," F B 7-1",8]
[13,6," F T",2]
[13,7," F B 2-1",5]
[13,7," F B 3-1",5]
[13,7," F B 4-1",5]
[13,7," F B 7-1",5]
[13,8," F B 6-1",6]
[13]
[13]
[13]
[13]
[13]
[13]
[13]
[13]
[13]
[13]
[13]
[13]
{"$rows_left_out":31}
{"sheet":"RESUMEN","index":4,"n_rows":57,"n_cols":4,"rows_kept":57,"cut":false,"hidden":false,"merged":[]}
[13,13,13,13]
["COINCIDENCIAS","LBRO","HOJA","Nº"]
[{"$f":"COUNTIF(A4:A1001,\">0\")","v":14},{"$f":"COUNTIF(B4:B1001,\">0\")","v":14},{"$f":"COUNTIF(C4:C1001,\"*\")","v":14},{"$f":"COUNTIF(D4:D1001,\">0\")","v":14}]
[{"$f":"INDEX('BASE DE DATOS'!$A$4:$A$99,MATCH('13'!B6&'13'!C6&'13'!D6,'BASE DE DATOS'!$B$4:$B$99&'BASE DE DATOS'!$C$4:$C$99&'BASE DE DATOS'!$D$4:$D$99,0))","v":11},{"$f":"INDEX('BASE DE DATOS'!$B$4:$B$99,MATCH('13'!B6&'13'!C6&'13'!D6,'BASE DE DATOS'!$B$4:$B$99&'BASE DE DATOS'!$C$4:$C$99&'BASE DE DATOS'!$D$4:$D$99,0))","v":5},{"$f":"INDEX('BASE DE DATOS'!$C$4:$C$99,MATCH('13'!B6&'13'!C6&'13'!D6,'BASE DE DATOS'!$B$4:$B$99&'BASE DE DATOS'!$C$4:$C$99&'BASE DE DATOS'!$D$4:$D$99,0))","v":" F B 1-1"},{"$f":"INDEX('BASE DE DATOS'!$D$4:$D$99,MATCH('13'!B6&'13'!C6&'13'!D6,'BASE DE DATOS'!$B$4:$B$99&'BASE DE DATOS'!$C$4:$C$99&'BASE DE DATOS'!$D$4:$D$99,0))","v":8}]
[{"$f":"INDEX('BASE DE DATOS'!$A$4:$A$99,MATCH('13'!B7&'13'!C7&'13'!D7,'BASE DE DATOS'!$B$4:$B$99&'BASE DE DATOS'!$C$4:$C$99&'BASE DE DATOS'!$D$4:$D$99,0))","v":11},{"$f":"INDEX('BASE DE DATOS'!$B$4:$B$99,MATCH('13'!B7&'13'!C7&'13'!D7,'BASE DE DATOS'!$B$4:$B$99&'BASE DE DATOS'!$C$4:$C$99&'BASE DE DATOS'!$D$4:$D$99,0))","v":5},{"$f":"INDEX('BASE DE DATOS'!$C$4:$C$99,MATCH('13'!B7&'13'!C7&'13'!D7,'BASE DE DATOS'!$B$4:$B$99&'BASE DE DATOS'!$C$4:$C$99&'BASE DE DATOS'!$D$4:$D$99,0))","v":" F B 2-1"},{"$f":"INDEX('BASE DE DATOS'!$D$4:$D$99,MATCH('13'!B7&'13'!C7&'13'!D7,'BASE DE DATOS'!$B$4:$B$99&'BASE DE DATOS'!$C$4:$C$99&'BASE DE DATOS'!$D$4:$D$99,0))","v":8}]
[{"$f":"INDEX('BASE DE DATOS'!$A$4:$A$99,MATCH('13'!B8&'13'!C8&'13'!D8,'BASE DE DATOS'!$B$4:$B$99&'BASE DE DATOS'!$C$4:$C$99&'BASE DE DATOS'!$D$4:$D$99,0))","v":11},{"$f":"INDEX('BASE DE DATOS'!$B$4:$B$99,MATCH('13'!B8&'13'!C8&'13'!D8,'BASE DE DATOS'!$B$4:$B$99&'BASE DE DATOS'!$C$4:$C$99&'BASE DE DATOS'!$D$4:$D$99,0))","v":5},{"$f":"INDEX('BASE DE DATOS'!$C$4:$C$99,MATCH('13'!B8&'13'!C8&'13'!D8,'BASE DE DATOS'!$B$4:$B$99&'BASE DE DATOS'!$C$4:$C$99&'BASE DE DATOS'!$D$4:$D$99,0))","v":" F B 5-1"},{"$f":"INDEX('BASE DE DATOS'!$D$4:$D$99,MATCH('13'!B8&'13'!C8&'13'!D8,'BASE DE DATOS'!$B$4:$B$99&'BASE DE DATOS'!$C$4:$C$99&'BASE DE DATOS'!$D$4:$D$99,0))","v":8}]
[{"$f":"INDEX('BASE DE DATOS'!$A$4:$A$99,MATCH('13'!B9&'13'!C9&'13'!D9,'BASE DE DATOS'!$B$4:$B$99&'BASE DE DATOS'!$C$4:$C$99&'BASE DE DATOS'!$D$4:$D$99,0))","v":11},{"$f":"INDEX('BASE DE DATOS'!$B$4:$B$99,MATCH('13'!B9&'13'!C9&'13'!D9,'BASE DE DATOS'!$B$4:$B$99&'BASE DE DATOS'!$C$4:$C$99&'BASE DE DATOS'!$D$4:$D$99,0))","v":5},{"$f":"INDEX('BASE DE DATOS'!$C$4:$C$99,MATCH('13'!B9&'13'!C9&'13'!D9,'BASE DE DATOS'!$B$4:$B$99&'BASE DE DATOS'!$C$4:$C$99&'BASE DE DATOS'!$D$4:$D$99,0))","v":" F B 7-1"},{"$f":"INDEX('BASE DE DATOS'!$D$4:$D$99,MATCH('13'!B9&'13'!C9&'13'!D9,'BASE DE DATOS'!$B$4:$B$99&'BASE DE DATOS'!$C$4:$C$99&'BASE DE DATOS'!$D$4:$D$99,0))","v":8}]
[{"$f":"INDEX('BASE DE DATOS'!$A$4:$A$99,MATCH('13'!B10&'13'!C10&'13'!D10,'BASE DE DATOS'!$B$4:$B$99&'BASE DE DATOS'!$C$4:$C$99&'BASE DE DATOS'!$D$4:$D$99,0))","v":10},{"$f":"INDEX('BASE DE DATOS'!$B$4:$B$99,MATCH('13'!B10&'13'!C10&'13'!D10,'BASE DE DATOS'!$B$4:$B$99&'BASE DE DATOS'!$C$4:$C$99&'BASE DE DATOS'!$D$4:$D$99,0))","v":5},{"$f":"INDEX('BASE DE DATOS'!$C$4:$C$99,MATCH('13'!B10&'13'!C10&'13'!D10,'BASE DE DATOS'!$B$4:$B$99&'BASE DE DATOS'!$C$4:$C$99&'BASE DE DATOS'!$D$4:$D$99,0))","v":" F T"},{"$f":"INDEX('BASE DE DATOS'!$D$4:$D$99,MATCH('13'!B10&'13'!C10&'13'!D10,'BASE DE DATOS'!$B$4:$B$99&'BASE DE DATOS'!$C$4:$C$99&'BASE DE DATOS'!$D$4:$D$99,0))","v":2}]
[{"$f":"INDEX('BASE DE DATOS'!$A$4:$A$99,MATCH('13'!B11&'13'!C11&'13'!D11,'BASE DE DATOS'!$B$4:$B$99&'BASE DE DATOS'!$C$4:$C$99&'BASE DE DATOS'!$D$4:$D$99,0))","v":11},{"$f":"INDEX('BASE DE DATOS'!$B$4:$B$99,MATCH('13'!B11&'13'!C11&'13'!D11,'BASE DE DATOS'!$B$4:$B$99&'BASE DE DATOS'!$C$4:$C$99&'BASE DE DATOS'!$D$4:$D$99,0))","v":6},{"$f":"INDEX('BASE DE DATOS'!$C$4:$C$99,MATCH('13'!B11&'13'!C11&'13'!D11,'BASE DE DATOS'!$B$4:$B$99&'BASE DE DATOS'!$C$4:$C$99&'BASE DE DATOS'!$D$4:$D$99,0))","v":" F B 2-1"},{"$f":"INDEX('BASE DE DATOS'!$D$4:$D$99,MATCH('13'!B11&'13'!C11&'13'!D11,'BASE DE DATOS'!$B$4:$B$99&'BASE DE DATOS'!$C$4:$C$99&'BASE DE DATOS'!$D$4:$D$99,0))","v":8}]
[{"$f":"INDEX('BASE DE DATOS'!$A$4:$A$99,MATCH('13'!B12&'13'!C12&'13'!D12,'BASE DE DATOS'!$B$4:$B$99&'BASE DE DATOS'!$C$4:$C$99&'BASE DE DATOS'!$D$4:$D$99,0))","v":11},{"$f":"INDEX('BASE DE DATOS'!$B$4:$B$99,MATCH('13'!B12&'13'!C12&'13'!D12,'BASE DE DATOS'!$B$4:$B$99&'BASE DE DATOS'!$C$4:$C$99&'BASE DE DATOS'!$D$4:$D$99,0))","v":6},{"$f":"INDEX('BASE DE DATOS'!$C$4:$C$99,MATCH('13'!B12&'13'!C12&'13'!D12,'BASE DE DATOS'!$B$4:$B$99&'BASE DE DATOS'!$C$4:$C$99&'BASE DE DATOS'!$D$4:$D$99,0))","v":" F B 7-1"},{"$f":"INDEX('BASE DE DATOS'!$D$4:$D$99,MATCH('13'!B12&'13'!C12&'13'!D12,'BASE DE DATOS'!$B$4:$B$99&'BASE DE DATOS'!$C$4:$C$99&'BASE DE DATOS'!$D$4:$D$99,0))","v":8}]
[{"$f":"INDEX('BASE DE DATOS'!$A$4:$A$99,MATCH('13'!B13&'13'!C13&'13'!D13,'BASE DE DATOS'!$B$4:$B$99&'BASE DE DATOS'!$C$4:$C$99&'BASE DE DATOS'!$D$4:$D$99,0))","v":10},{"$f":"INDEX('BASE DE DATOS'!$B$4:$B$99,MATCH('13'!B13&'13'!C13&'13'!D13,'BASE DE DATOS'!$B$4:$B$99&'BASE DE DATOS'!$C$4:$C$99&'BASE DE DATOS'!$D$4:$D$99,0))","v":6},{"$f":"INDEX('BASE DE DATOS'!$C$4:$C$99,MATCH('13'!B13&'13'!C13&'13'!D13,'BASE DE DATOS'!$B$4:$B$99&'BASE DE DATOS'!$C$4:$C$99&'BASE DE DATOS'!$D$4:$D$99,0))","v":" F T"},{"$f":"INDEX('BASE DE DATOS'!$D$4:$D$99,MATCH('13'!B13&'13'!C13&'13'!D13,'BASE DE DATOS'!$B$4:$B$99&'BASE DE DATOS'!$C$4:$C$99&'BASE DE DATOS'!$D$4:$D$99,0))","v":2}]
[{"$f":"INDEX('BASE DE DATOS'!$A$4:$A$99,MATCH('13'!B14&'13'!C14&'13'!D14,'BASE DE DATOS'!$B$4:$B$99&'BASE DE DATOS'!$C$4:$C$99&'BASE DE DATOS'!$D$4:$D$99,0))","v":11},{"$f":"INDEX('BASE DE DATOS'!$B$4:$B$99,MATCH('13'!B14&'13'!C14&'13'!D14,'BASE DE DATOS'!$B$4:$B$99&'BASE DE DATOS'!$C$4:$C$99&'BASE DE DATOS'!$D$4:$D$99,0))","v":7},{"$f":"INDEX('BASE DE DATOS'!$C$4:$C$99,MATCH('13'!B14&'13'!C14&'13'!D14,'BASE DE DATOS'!$B$4:$B$99&'BASE DE DATOS'!$C$4:$C$99&'BASE DE DATOS'!$D$4:$D$99,0))","v":" F B 2-1"},{"$f":"INDEX('BASE DE DATOS'!$D$4:$D$99,MATCH('13'!B14&'13'!C14&'13'!D14,'BASE DE DATOS'!$B$4:$B$99&'BASE DE DATOS'!$C$4:$C$99&'BASE DE DATOS'!$D$4:$D$99,0))","v":5}]
[11,7," F B 3-1",5]
[{"$f":"INDEX('BASE DE DATOS'!$A$4:$A$99,MATCH('13'!B15&'13'!C15&'13'!D15,'BASE DE DATOS'!$B$4:$B$99&'BASE DE DATOS'!$C$4:$C$99&'BASE DE DATOS'!$D$4:$D$99,0))","v":10},{"$f":"INDEX('BASE DE DATOS'!$B$4:$B$99,MATCH('13'!B15&'13'!C15&'13'!D15,'BASE DE DATOS'!$B$4:$B$99&'BASE DE DATOS'!$C$4:$C$99&'BASE DE DATOS'!$D$4:$D$99,0))","v":7},{"$f":"INDEX('BASE DE DATOS'!$C$4:$C$99,MATCH('13'!B15&'13'!C15&'13'!D15,'BASE DE DATOS'!$B$4:$B$99&'BASE DE DATOS'!$C$4:$C$99&'BASE DE DATOS'!$D$4:$D$99,0))","v":" F B 3-1"},{"$f":"INDEX('BASE DE DATOS'!$D$4:$D$99,MATCH('13'!B15&'13'!C15&'13'!D15,'BASE DE DATOS'!$B$4:$B$99&'BASE DE DATOS'!$C$4:$C$99&'BASE DE DATOS'!$D$4:$D$99,0))","v":5}]
[{"$f":"INDEX('BASE DE DATOS'!$A$4:$A$99,MATCH('13'!B16&'13'!C16&'13'!D16,'BASE DE DATOS'!$B$4:$B$99&'BASE DE DATOS'!$C$4:$C$99&'BASE DE DATOS'!$D$4:$D$99,0))","v":13},{"$f":"INDEX('BASE DE DATOS'!$B$4:$B$99,MATCH('13'!B16&'13'!C16&'13'!D16,'BASE DE DATOS'!$B$4:$B$99&'BASE DE DATOS'!$C$4:$C$99&'BASE DE DATOS'!$D$4:$D$99,0))","v":7},{"$f":"INDEX('BASE DE DATOS'!$C$4:$C$99,MATCH('13'!B16&'13'!C16&'13'!D16,'BASE DE DATOS'!$B$4:$B$99&'BASE DE DATOS'!$C$4:$C$99&'BASE DE DATOS'!$D$4:$D$99,0))","v":" F B 4-1"},{"$f":"INDEX('BASE DE DATOS'!$D$4:$D$99,MATCH('13'!B16&'13'!C16&'13'!D16,'BASE DE DATOS'!$B$4:$B$99&'BASE DE DATOS'!$C$4:$C$99&'BASE DE DATOS'!$D$4:$D$99,0))","v":5}]
[{"$f":"INDEX('BASE DE DATOS'!$A$4:$A$99,MATCH('13'!B17&'13'!C17&'13'!D17,'BASE DE DATOS'!$B$4:$B$99&'BASE DE DATOS'!$C$4:$C$99&'BASE DE DATOS'!$D$4:$D$99,0))","v":10},{"$f":"INDEX('BASE DE DATOS'!$B$4:$B$99,MATCH('13'!B17&'13'!C17&'13'!D17,'BASE DE DATOS'!$B$4:$B$99&'BASE DE DATOS'!$C$4:$C$99&'BASE DE DATOS'!$D$4:$D$99,0))","v":7},{"$f":"INDEX('BASE DE DATOS'!$C$4:$C$99,MATCH('13'!B17&'13'!C17&'13'!D17,'BASE DE DATOS'!$B$4:$B$99&'BASE DE DATOS'!$C$4:$C$99&'BASE DE DATOS'!$D$4:$D$99,0))","v":" F B 7-1"},{"$f":"INDEX('BASE DE DATOS'!$D$4:$D$99,MATCH('13'!B17&'13'!C17&'13'!D17,'BASE DE DATOS'!$B$4:$B$99&'BASE DE DATOS'!$C$4:$C$99&'BASE DE DATOS'!$D$4:$D$99,0))","v":5}]
[{"$f":"INDEX('BASE DE DATOS'!$A$4:$A$99,MATCH('13'!B18&'13'!C18&'13'!D18,'BASE DE DATOS'!$B$4:$B$99&'BASE DE DATOS'!$C$4:$C$99&'BASE DE DATOS'!$D$4:$D$99,0))","v":10},{"$f":"INDEX('BASE DE DATOS'!$B$4:$B$99,MATCH('13'!B18&'13'!C18&'13'!D18,'BASE DE DATOS'!$B$4:$B$99&'BASE DE DATOS'!$C$4:$C$99&'BASE DE DATOS'!$D$4:$D$99,0))","v":8},{"$f":"INDEX('BASE DE DATOS'!$C$4:$C$99,MATCH('13'!B18&'13'!C18&'13'!D18,'BASE DE DATOS'!$B$4:$B$99&'BASE DE DATOS'!$C$4:$C$99&'BASE DE DATOS'!$D$4:$D$99,0))","v":" F B 6-1"},{"$f":"INDEX('BASE DE DATOS'!$D$4:$D$99,MATCH('13'!B18&'13'!C18&'13'!D18,'BASE DE DATOS'!$B$4:$B$99&'BASE DE DATOS'!$C$4:$C$99&'BASE DE DATOS'!$D$4:$D$99,0))","v":6}]
[{"$f":"INDEX('BASE DE DATOS'!$A$4:$A$99,MATCH('13'!B19&'13'!C19&'13'!D19,'BASE DE DATOS'!$B$4:$B$99&'BASE DE DATOS'!$C$4:$C$99&'BASE DE DATOS'!$D$4:$D$99,0))","v":0},{"$f":"INDEX('BASE DE DATOS'!$B$4:$B$99,MATCH('13'!B19&'13'!C19&'13'!D19,'BASE DE DATOS'!$B$4:$B$99&'BASE DE DATOS'!$C$4:$C$99&'BASE DE DATOS'!$D$4:$D$99,0))","v":0},{"$f":"INDEX('BASE DE DATOS'!$C$4:$C$99,MATCH('13'!B19&'13'!C19&'13'!D19,'BASE DE DATOS'!$B$4:$B$99&'BASE DE DATOS'!$C$4:$C$99&'BASE DE DATOS'!$D$4:$D$99,0))","v":0},{"$f":"INDEX('BASE DE DATOS'!$D$4:$D$99,MATCH('13'!B19&'13'!C19&'13'!D19,'BASE DE DATOS'!$B$4:$B$99&'BASE DE DATOS'!$C$4:$C$99&'BASE DE DATOS'!$D$4:$D$99,0))","v":0}]
[{"$f":"INDEX('BASE DE DATOS'!$A$4:$A$99,MATCH('13'!B20&'13'!C20&'13'!D20,'BASE DE DATOS'!$B$4:$B$99&'BASE DE DATOS'!$C$4:$C$99&'BASE DE DATOS'!$D$4:$D$99,0))","v":0},{"$f":"INDEX('BASE DE DATOS'!$B$4:$B$99,MATCH('13'!B20&'13'!C20&'13'!D20,'BASE DE DATOS'!$B$4:$B$99&'BASE DE DATOS'!$C$4:$C$99&'BASE DE DATOS'!$D$4:$D$99,0))","v":0},{"$f":"INDEX('BASE DE DATOS'!$C$4:$C$99,MATCH('13'!B20&'13'!C20&'13'!D20,'BASE DE DATOS'!$B$4:$B$99&'BASE DE DATOS'!$C$4:$C$99&'BASE DE DATOS'!$D$4:$D$99,0))","v":0},{"$f":"INDEX('BASE DE DATOS'!$D$4:$D$99,MATCH('13'!B20&'13'!C20&'13'!D20,'BASE DE DATOS'!$B$4:$B$99&'BASE DE DATOS'!$C$4:$C$99&'BASE DE DATOS'!$D$4:$D$99,0))","v":0}]
[{"$f":"INDEX('BASE DE DATOS'!$A$4:$A$99,MATCH('13'!B21&'13'!C21&'13'!D21,'BASE DE DATOS'!$B$4:$B$99&'BASE DE DATOS'!$C$4:$C$99&'BASE DE DATOS'!$D$4:$D$99,0))","v":0},{"$f":"INDEX('BASE DE DATOS'!$B$4:$B$99,MATCH('13'!B21&'13'!C21&'13'!D21,'BASE DE DATOS'!$B$4:$B$99&'BASE DE DATOS'!$C$4:$C$99&'BASE DE DATOS'!$D$4:$D$99,0))","v":0},{"$f":"INDEX('BASE DE DATOS'!$C$4:$C$99,MATCH('13'!B21&'13'!C21&'13'!D21,'BASE DE DATOS'!$B$4:$B$99&'BASE DE DATOS'!$C$4:$C$99&'BASE DE DATOS'!$D$4:$D$99,0))","v":0},{"$f":"INDEX('BASE DE DATOS'!$D$4:$D$99,MATCH('13'!B21&'13'!C21&'13'!D21,'BASE DE DATOS'!$B$4:$B$99&'BASE DE DATOS'!$C$4:$C$99&'BASE DE DATOS'!$D$4:$D$99,0))","v":0}]
[{"$f":"INDEX('BASE DE DATOS'!$A$4:$A$99,MATCH('13'!B22&'13'!C22&'13'!D22,'BASE DE DATOS'!$B$4:$B$99&'BASE DE DATOS'!$C$4:$C$99&'BASE DE DATOS'!$D$4:$D$99,0))","v":0},{"$f":"INDEX('BASE DE DATOS'!$B$4:$B$99,MATCH('13'!B22&'13'!C22&'13'!D22,'BASE DE DATOS'!$B$4:$B$99&'BASE DE DATOS'!$C$4:$C$99&'BASE DE DATOS'!$D$4:$D$99,0))","v":0},{"$f":"INDEX('BASE DE DATOS'!$C$4:$C$99,MATCH('13'!B22&'13'!C22&'13'!D22,'BASE DE DATOS'!$B$4:$B$99&'BASE DE DATOS'!$C$4:$C$99&'BASE DE DATOS'!$D$4:$D$99,0))","v":0},{"$f":"INDEX('BASE DE DATOS'!$D$4:$D$99,MATCH('13'!B22&'13'!C22&'13'!D22,'BASE DE DATOS'!$B$4:$B$99&'BASE DE DATOS'!$C$4:$C$99&'BASE DE DATOS'!$D$4:$D$99,0))","v":0}]
[{"$f":"INDEX('BASE DE DATOS'!$A$4:$A$99,MATCH('13'!B23&'13'!C23&'13'!D23,'BASE DE DATOS'!$B$4:$B$99&'BASE DE DATOS'!$C$4:$C$99&'BASE DE DATOS'!$D$4:$D$99,0))","v":0},{"$f":"INDEX('BASE DE DATOS'!$B$4:$B$99,MATCH('13'!B23&'13'!C23&'13'!D23,'BASE DE DATOS'!$B$4:$B$99&'BASE DE DATOS'!$C$4:$C$99&'BASE DE DATOS'!$D$4:$D$99,0))","v":0},{"$f":"INDEX('BASE DE DATOS'!$C$4:$C$99,MATCH('13'!B23&'13'!C23&'13'!D23,'BASE DE DATOS'!$B$4:$B$99&'BASE DE DATOS'!$C$4:$C$99&'BASE DE DATOS'!$D$4:$D$99,0))","v":0},{"$f":"INDEX('BASE DE DATOS'!$D$4:$D$99,MATCH('13'!B23&'13'!C23&'13'!D23,'BASE DE DATOS'!$B$4:$B$99&'BASE DE DATOS'!$C$4:$C$99&'BASE DE DATOS'!$D$4:$D$99,0))","v":0}]
[{"$f":"INDEX('BASE DE DATOS'!$A$4:$A$99,MATCH('13'!B24&'13'!C24&'13'!D24,'BASE DE DATOS'!$B$4:$B$99&'BASE DE DATOS'!$C$4:$C$99&'BASE DE DATOS'!$D$4:$D$99,0))","v":0},{"$f":"INDEX('BASE DE DATOS'!$B$4:$B$99,MATCH('13'!B24&'13'!C24&'13'!D24,'BASE DE DATOS'!$B$4:$B$99&'BASE DE DATOS'!$C$4:$C$99&'BASE DE DATOS'!$D$4:$D$99,0))","v":0},{"$f":"INDEX('BASE DE DATOS'!$C$4:$C$99,MATCH('13'!B24&'13'!C24&'13'!D24,'BASE DE DATOS'!$B$4:$B$99&'BASE DE DATOS'!$C$4:$C$99&'BASE DE DATOS'!$D$4:$D$99,0))","v":0},{"$f":"INDEX('BASE DE DATOS'!$D$4:$D$99,MATCH('13'!B24&'13'!C24&'13'!D24,'BASE DE DATOS'!$B$4:$B$99&'BASE DE DATOS'!$C$4:$C$99&'BASE DE DATOS'!$D$4:$D$99,0))","v":0}]
[{"$f":"INDEX('BASE DE DATOS'!$A$4:$A$99,MATCH('13'!B25&'13'!C25&'13'!D25,'BASE DE DATOS'!$B$4:$B$99&'BASE DE DATOS'!$C$4:$C$99&'BASE DE DATOS'!$D$4:$D$99,0))","v":0},{"$f":"INDEX('BASE DE DATOS'!$B$4:$B$99,MATCH('13'!B25&'13'!C25&'13'!D25,'BASE DE DATOS'!$B$4:$B$99&'BASE DE DATOS'!$C$4:$C$99&'BASE DE DATOS'!$D$4:$D$99,0))","v":0},{"$f":"INDEX('BASE DE DATOS'!$C$4:$C$99,MATCH('13'!B25&'13'!C25&'13'!D25,'BASE DE DATOS'!$B$4:$B$99&'BASE DE DATOS'!$C$4:$C$99&'BASE DE DATOS'!$D$4:$D$99,0))","v":0},{"$f":"INDEX('BASE DE DATOS'!$D$4:$D$99,MATCH('13'!B25&'13'!C25&'13'!D25,'BASE DE DATOS'!$B$4:$B$99&'BASE DE DATOS'!$C$4:$C$99&'BASE DE DATOS'!$D$4:$D$99,0))","v":0}]
[{"$f":"INDEX('BASE DE DATOS'!$A$4:$A$99,MATCH('13'!B26&'13'!C26&'13'!D26,'BASE DE DATOS'!$B$4:$B$99&'BASE DE DATOS'!$C$4:$C$99&'BASE DE DATOS'!$D$4:$D$99,0))","v":0},{"$f":"INDEX('BASE DE DATOS'!$B$4:$B$99,MATCH('13'!B26&'13'!C26&'13'!D26,'BASE DE DATOS'!$B$4:$B$99&'BASE DE DATOS'!$C$4:$C$99&'BASE DE DATOS'!$D$4:$D$99,0))","v":0},{"$f":"INDEX('BASE DE DATOS'!$C$4:$C$99,MATCH('13'!B26&'13'!C26&'13'!D26,'BASE DE DATOS'!$B$4:$B$99&'BASE DE DATOS'!$C$4:$C$99&'BASE DE DATOS'!$D$4:$D$99,0))","v":0},{"$f":"INDEX('BASE DE DATOS'!$D$4:$D$99,MATCH('13'!B26&'13'!C26&'13'!D26,'BASE DE DATOS'!$B$4:$B$99&'BASE DE DATOS'!$C$4:$C$99&'BASE DE DATOS'!$D$4:$D$99,0))","v":0}]
[{"$f":"INDEX('BASE DE DATOS'!$A$4:$A$99,MATCH('13'!B27&'13'!C27&'13'!D27,'BASE DE DATOS'!$B$4:$B$99&'BASE DE DATOS'!$C$4:$C$99&'BASE DE DATOS'!$D$4:$D$99,0))","v":0},{"$f":"INDEX('BASE DE DATOS'!$B$4:$B$99,MATCH('13'!B27&'13'!C27&'13'!D27,'BASE DE DATOS'!$B$4:$B$99&'BASE DE DATOS'!$C$4:$C$99&'BASE DE DATOS'!$D$4:$D$99,0))","v":0},{"$f":"INDEX('BASE DE DATOS'!$C$4:$C$99,MATCH('13'!B27&'13'!C27&'13'!D27,'BASE DE DATOS'!$B$4:$B$99&'BASE DE DATOS'!$C$4:$C$99&'BASE DE DATOS'!$D$4:$D$99,0))","v":0},{"$f":"INDEX('BASE DE DATOS'!$D$4:$D$99,MATCH('13'!B27&'13'!C27&'13'!D27,'BASE DE DATOS'!$B$4:$B$99&'BASE DE DATOS'!$C$4:$C$99&'BASE DE DATOS'!$D$4:$D$99,0))","v":0}]
[{"$f":"INDEX('BASE DE DATOS'!$A$4:$A$99,MATCH('13'!B28&'13'!C28&'13'!D28,'BASE DE DATOS'!$B$4:$B$99&'BASE DE DATOS'!$C$4:$C$99&'BASE DE DATOS'!$D$4:$D$99,0))","v":0},{"$f":"INDEX('BASE DE DATOS'!$B$4:$B$99,MATCH('13'!B28&'13'!C28&'13'!D28,'BASE DE DATOS'!$B$4:$B$99&'BASE DE DATOS'!$C$4:$C$99&'BASE DE DATOS'!$D$4:$D$99,0))","v":0},{"$f":"INDEX('BASE DE DATOS'!$C$4:$C$99,MATCH('13'!B28&'13'!C28&'13'!D28,'BASE DE DATOS'!$B$4:$B$99&'BASE DE DATOS'!$C$4:$C$99&'BASE DE DATOS'!$D$4:$D$99,0))","v":0},{"$f":"INDEX('BASE DE DATOS'!$D$4:$D$99,MATCH('13'!B28&'13'!C28&'13'!D28,'BASE DE DATOS'!$B$4:$B$99&'BASE DE DATOS'!$C$4:$C$99&'BASE DE DATOS'!$D$4:$D$99,0))","v":0}]
[{"$f":"INDEX('BASE DE DATOS'!$A$4:$A$99,MATCH('13'!B29&'13'!C29&'13'!D29,'BASE DE DATOS'!$B$4:$B$99&'BASE DE DATOS'!$C$4:$C$99&'BASE DE DATOS'!$D$4:$D$99,0))","v":0},{"$f":"INDEX('BASE DE DATOS'!$B$4:$B$99,MATCH('13'!B29&'13'!C29&'13'!D29,'BASE DE DATOS'!$B$4:$B$99&'BASE DE DATOS'!$C$4:$C$99&'BASE DE DATOS'!$D$4:$D$99,0))","v":0},{"$f":"INDEX('BASE DE DATOS'!$C$4:$C$99,MATCH('13'!B29&'13'!C29&'13'!D29,'BASE DE DATOS'!$B$4:$B$99&'BASE DE DATOS'!$C$4:$C$99&'BASE DE DATOS'!$D$4:$D$99,0))","v":0},{"$f":"INDEX('BASE DE DATOS'!$D$4:$D$99,MATCH('13'!B29&'13'!C29&'13'!D29,'BASE DE DATOS'!$B$4:$B$99&'BASE DE DATOS'!$C$4:$C$99&'BASE DE DATOS'!$D$4:$D$99,0))","v":0}]
[{"$f":"INDEX('BASE DE DATOS'!$A$4:$A$99,MATCH('13'!B30&'13'!C30&'13'!D30,'BASE DE DATOS'!$B$4:$B$99&'BASE DE DATOS'!$C$4:$C$99&'BASE DE DATOS'!$D$4:$D$99,0))","v":0},{"$f":"INDEX('BASE DE DATOS'!$B$4:$B$99,MATCH('13'!B30&'13'!C30&'13'!D30,'BASE DE DATOS'!$B$4:$B$99&'BASE DE DATOS'!$C$4:$C$99&'BASE DE DATOS'!$D$4:$D$99,0))","v":0},{"$f":"INDEX('BASE DE DATOS'!$C$4:$C$99,MATCH('13'!B30&'13'!C30&'13'!D30,'BASE DE DATOS'!$B$4:$B$99&'BASE DE DATOS'!$C$4:$C$99&'BASE DE DATOS'!$D$4:$D$99,0))","v":0},{"$f":"INDEX('BASE DE DATOS'!$D$4:$D$99,MATCH('13'!B30&'13'!C30&'13'!D30,'BASE DE DATOS'!$B$4:$B$99&'BASE DE DATOS'!$C$4:$C$99&'BASE DE DATOS'!$D$4:$D$99,0))","v":0}]
[{"$f":"INDEX('BASE DE DATOS'!$A$4:$A$99,MATCH('13'!B31&'13'!C31&'13'!D31,'BASE DE DATOS'!$B$4:$B$99&'BASE DE DATOS'!$C$4:$C$99&'BASE DE DATOS'!$D$4:$D$99,0))","v":0},{"$f":"INDEX('BASE DE DATOS'!$B$4:$B$99,MATCH('13'!B31&'13'!C31&'13'!D31,'BASE DE DATOS'!$B$4:$B$99&'BASE DE DATOS'!$C$4:$C$99&'BASE DE DATOS'!$D$4:$D$99,0))","v":0},{"$f":"INDEX('BASE DE DATOS'!$C$4:$C$99,MATCH('13'!B31&'13'!C31&'13'!D31,'BASE DE DATOS'!$B$4:$B$99&'BASE DE DATOS'!$C$4:$C$99&'BASE DE DATOS'!$D$4:$D$99,0))","v":0},{"$f":"INDEX('BASE DE DATOS'!$D$4:$D$99,MATCH('13'!B31&'13'!C31&'13'!D31,'BASE DE DATOS'!$B$4:$B$99&'BASE DE DATOS'!$C$4:$C$99&'BASE DE DATOS'!$D$4:$D$99,0))","v":0}]
{"$rows_left_out":28}
{"sheet":"BASE DE DATOS","index":5,"n_rows":67,"n_cols":4,"rows_kept":67,"cut":false,"hidden":false,"merged":[]}
[null,"LBRO","HOJA","Nº"]
[null,"LBRO","HOJA","Nº"]
[]
[10,1," F T",2]
[10,5," F T",2]
[10,6," F B 5-1",7]
[10,6," F B 8-1",7]
[10,6," F B 1-1",8]
[10,6," F B 5-1",8]
[10,6," F T",2]
[10,7," F B 3-1",5]
[10,7," F B 5-1",5]
[10,7," F B 7-1",5]
[10,7," F T",3]
[10,8," F B 1-1",6]
[10,8," F B 6-1",6]
[10,8," F B 8-1",6]
[11,1," F T",2]
[11,1," F T",3]
[11,5," F B 5-1",7]
[11,5," F B 1-1",8]
[11,5," F B 2-1",8]
[11,5," F B 5-1",8]
[11,5," F B 7-1",8]
[11,5," F B 8-1",8]
[11,6," F B 2-1",8]
[11,6," F B 7-1",8]
[11,6," F T",3]
[11,7," F B 1-1",5]
[11,7," F B 2-1",5]
{"$rows_left_out":37}