{"text_format":"1","workbook":"xlsx","n_sheets":3,"sheets":["CALENDARIO 2017","FORMATO 6","FORMATO 7"],"not_rendered":{"charts":0,"images":2,"macros":0,"external_links":1,"defined_names":9,"comments":0,"pivot_tables":0},"unopened":[],"bounds":{"document_bytes":16777216,"sheet_cells":100000,"rows_first":2000,"rows_last":500,"rows_between":2000,"halvings":0,"cell_chars":16384,"cell_head_chars":4096},"cells_cut":0,"cells_raw":0,"read":"whole","date_system":"1900"}

{"sheet":"CALENDARIO 2017","index":0,"n_rows":34,"n_cols":86,"rows_kept":34,"cut":false,"hidden":false,"merged":[[33,43,33,45],[33,49,33,51],[33,55,33,57],[33,61,33,63],[33,67,33,69],[32,17,32,19],[32,24,32,26],[32,31,32,33],[32,37,32,39],[32,43,32,45],[32,49,32,51],[32,55,32,57],[32,61,32,63],[36,16,36,20],[30,55,30,57],[30,61,30,63],[30,67,30,69],[31,17,31,19],[31,24,31,26],[31,31,31,33],[31,37,31,39],[31,43,31,45],[31,49,31,51],[31,55,31,57],[30,17,30,19],[30,24,30,26],[30,31,30,33],[30,37,30,39],[30,43,30,45],[30,49,30,51],[31,61,31,63],[31,67,31,69],[32,67,32,69],[33,17,33,19],[33,24,33,26],[33,31,33,33],[33,37,33,39],[29,17,29,19],[29,24,29,26],[29,31,29,33],[29,37,29,39],[29,43,29,45],[29,49,29,51],[29,55,29,57],[29,61,29,63],[29,67,29,69],[28,17,28,19],[28,24,28,26],[28,31,28,33],[28,37,28,39],[28,43,28,45],[28,49,28,51],[28,55,28,57],[28,61,28,63],[28,67,28,69],[27,61,27,63],[27,67,27,69],[27,24,27,26],[27,31,27,33],[27,37,27,39],[27,43,27,45],[27,49,27,51],[27,55,27,57],[25,67,25,69],[25,61,25,63],[26,67,26,69],[26,24,26,26],[26,31,26,33],[26,37,26,39],[26,43,26,45],[26,49,26,51],[25,24,25,26],[25,31,25,33],[23,67,23,69],[24,24,24,26],[24,31,24,33],[24,37,24,39],[24,43,24,45],[24,49,24,51],[24,55,24,57],[24,61,24,63],[24,67,24,69],[23,24,23,26],[23,31,23,33],[23,37,23,39],[23,43,23,45],[23,49,23,51],[23,55,23,57],[21,24,21,26],[21,31,21,33],[21,37,21,39],[21,43,21,45],[21,49,21,51],[25,55,25,57],[21,55,21,57],[21,61,21,63],[26,55,26,57],[26,61,26,63],[22,37,22,39],[25,37,25,39],[25,43,25,45],[25,49,25,51],[23,61,23,63],[21,67,21,69],[22,55,22,57],[22,61,22,63],[22,67,22,69],[19,61,19,63],[19,67,19,69],[20,24,20,26],[20,31,20,33],[20,37,20,39],[20,43,20,45],[20,49,20,51],[20,55,20,57],[20,61,20,63],[20,67,20,69],[19,24,19,26],[19,31,19,33],[19,37,19,39],[19,43,19,45],[19,49,19,51],[19,55,19,57],[22,24,22,26],[22,31,22,33],[22,43,22,45],[22,49,22,51],[18,24,18,26],[18,31,18,33],[17,61,17,63],[17,55,17,57],[17,67,17,69],[18,55,18,57],[18,61,18,63],[18,67,18,69],[18,37,18,39],[18,43,18,45],[18,49,18,51],[17,24,17,26],[17,31,17,33],[17,37,17,39],[17,43,17,45],[17,49,17,51],[12,36,13,40],[12,42,13,46],[15,43,15,45],[15,49,15,51],[15,55,15,57],[15,61,15,63],[15,67,15,69],[16,24,16,26],[16,31,16,33],[16,37,16,39],[16,43,16,45],[16,49,16,51],[16,55,16,57],[16,61,16,63],[16,67,16,69],[2,42,2,46],[2,48,2,52],[2,54,2,58],[12,48,13,52],[12,54,13,58],[2,60,2,64],[2,66,2,70],[11,2,11,6],[2,1,2,6],[2,10,2,14],[2,16,2,20],[2,23,2,27],[2,30,2,34],[2,36,2,40],[3,1,3,2],[4,1,4,4],[5,1,5,3],[6,1,6,3],[12,60,13,64],[12,66,13,70],[12,10,13,14],[12,16,13,20],[12,23,13,27],[12,30,13,34],[2,72,2,76],[12,72,13,76],[15,73,15,75],[16,73,16,75],[17,73,17,75],[18,73,18,75],[19,73,19,75],[20,73,20,75],[21,73,21,75],[31,73,31,75],[32,73,32,75],[33,73,33,75],[22,73,22,75],[23,73,23,75],[24,73,24,75],[25,73,25,75],[26,73,26,75],[27,73,27,75],[28,73,28,75],[29,73,29,75],[30,73,30,75]]}
[null,"Año",2015]
[null,1,2,3,4,5,6,7,null,1,2,3,4,5,6,7,2,3,4,5,6,7,1,2,3,4,5,6,7]
[null,null,null,null,null,null,null,null,null,null,"Febrero",null,null,null,null,null,"Marzo",null,null,null,null,null,"Abril","ABRIL",null,null,null,null,null,null,"MAYO",null,null,null,null,null,"JUNIO",null,null,null,null,null,"JULIO",null,null,null,null,null,"AGOSTO",null,null,null,null,null,"SEPTIEMBRE",null,null,null,null,null,"OCTUBRE",null,null,null,null,null,"NOVIEMBRE",null,null,null,null,null,"DICIEMBRE"]
[null,null,null,null,null,null,null,null,null,null,"L","M","M","J","V",null,"L","M","M","J","V",null,null,"L","M","M","J","V",null,null,"L","M","M","J","V",null,"L","M","M","J","V",null,"L","M","M","J","V",null,"L","M","M","J","V",null,"L","M","M","J","V",null,"L","M","M","J","V",null,"L","M","M","J","V",null,"L","M","M","J","V"]
[null,null,null,null,null,null,null,null,null,null,null,null,"2017-02-01","2017-02-02","2017-02-03",null,null,null,"1900-01-01","1900-01-02","1900-01-03",null,"",null,null,null,null,null,null,null,null,"1900-01-02","1900-01-03","1900-01-04","1900-01-05",null,null,null,null,"1900-01-01","1900-01-02",null,null,null,null,null,null,null,null,"1900-01-01","1900-01-02","1900-01-03","1900-01-04",null,null,null,null,null,"1900-01-01",null,null,null,null,null,null,null,null,null,"1900-01-01","1900-01-02","1900-01-03",null,null,null,null,null,"1900-01-01",null,"1900-01-01","1900-01-02","1900-01-03",null,"1900-01-07","1900-01-08","1900-01-09","1900-01-10"]
[null,null,null,null,null,null,null,null,null,null,"1900-01-06","1900-01-07","1900-01-08","1900-01-09","1900-01-10",null,"1900-01-06","1900-01-07","1900-01-08","1900-01-09","1900-01-10",null,null,"1900-01-03","1900-01-04","1900-01-05","1900-01-06","1900-01-07",null,null,"1900-01-08","1900-01-09","1900-01-10","1900-01-11","1900-01-12",null,"1900-01-05","1900-01-06","1900-01-07","1900-01-08","1900-01-09",null,null,null,null,null,null,null,null,"1900-01-08","1900-01-09","1900-01-10","1900-01-11",null,"1900-01-04","1900-01-05","1900-01-06","1900-01-07","1900-01-08",null,"1900-01-02","1900-01-03","1900-01-04","1900-01-05","1900-01-06",null,null,"1900-01-07","1900-01-08","1900-01-09","1900-01-10"]
[null,null,null,null,null,null,null,null,null,null,"1900-01-13","1900-01-14","1900-01-15","1900-01-16","1900-01-17",null,"1900-01-13","1900-01-14","1900-01-15","1900-01-16","1900-01-17",null,null,null,null,null,null,null,null,null,"1900-01-15","1900-01-16","1900-01-17","1900-01-18","1900-01-19",null,"1900-01-12","1900-01-13","1900-01-14","1900-01-15","1900-01-16",null,"1900-01-10","1900-01-11","1900-01-12","1900-01-13","1900-01-14",null,"1900-01-14","1900-01-15","1900-01-16","1900-01-17","1900-01-18",null,"1900-01-11","1900-01-12","1900-01-13","1900-01-14","1900-01-15",null,null,null,null,null,null,null,null,"1900-01-14","1900-01-15","1900-01-16","1900-01-17"]
[null,null,null,null,null,null,null,null,null,null,"1900-01-20","1900-01-21","1900-01-22","1900-01-23","1900-01-24",null,null,"1900-01-21","1900-01-22","1900-01-23","1900-01-24",null,null,"1900-01-17","1900-01-18","1900-01-19","1900-01-20","1900-01-21",null,null,"1900-01-22","1900-01-23","1900-01-24","1900-01-25","1900-01-26",null,null,"1900-01-20","1900-01-21","1900-01-22","1900-01-23",null,"1900-01-17","1900-01-18","1900-01-19",null,"1900-01-21",null,null,"1900-01-22","1900-01-23","1900-01-24","1900-01-25",null,"1900-01-18","1900-01-19","1900-01-20","1900-01-21","1900-01-22",null,null,"1900-01-17","1900-01-18","1900-01-19","1900-01-20",null,"1900-01-20","1900-01-21","1900-01-22","1900-01-23","1900-01-24"]
[null,null,null,null,null,null,null,null,null,"","1900-01-27","1900-01-28",null,null,null,"","1900-01-27","1900-01-28","1900-01-29","1900-01-30","1900-01-31","",null,"1900-01-24","1900-01-25","1900-01-26","1900-01-27","1900-01-28","",null,null,"1900-01-30","1900-01-31",null,null,null,null,null,null,null,null,null,"1900-01-24","1900-01-25","1900-01-26","1900-01-27","1900-01-28",null,"1900-01-28","1900-01-29","1900-01-30","1900-01-31",null,null,"1900-01-25","1900-01-26","1900-01-27","1900-01-28","1900-01-29",null,"1900-01-23","1900-01-24","1900-01-25","1900-01-26","1900-01-27",null,"1900-01-27","1900-01-28","1900-01-29","1900-01-30"]
[null,null,null,null,null,null,null,null,null,null,null,null,null,null,null,null,null,null,null,null,null,null,null,null,null,null,null,null,null,null,null,null,null,null,null,null,null,null,null,null,null,null,"1900-01-31",null,null,null,null,null,null,null,null,null,null,null,null,null,null,null,null,null,"1900-01-30","1900-01-31"]
{"$rows_left_out":25}
{"sheet":"FORMATO 6","index":1,"n_rows":21,"n_cols":37,"rows_kept":21,"cut":false,"hidden":false,"merged":[[12,26,12,28],[18,29,18,32],[19,29,19,32],[13,26,13,28],[14,26,14,28],[15,33,15,35],[17,29,17,32],[16,23,16,25],[17,23,17,25],[13,23,13,25],[14,23,14,25],[18,6,18,16],[19,6,19,16],[14,6,14,16],[15,6,15,16],[6,6,7,16],[6,17,7,19],[8,6,8,16],[8,17,8,19],[9,17,9,19],[10,17,10,19],[11,17,11,19],[16,17,16,19],[17,17,17,19],[14,17,14,19],[15,17,15,19],[12,17,12,19],[13,17,13,19],[20,0,20,19],[6,0,7,0],[9,1,9,5],[8,1,8,5],[13,1,13,5],[14,1,14,5],[15,1,15,5],[12,6,12,16],[13,6,13,16],[9,6,9,16],[10,6,10,16],[11,6,11,16],[16,6,16,16],[17,6,17,16],[19,17,19,19],[18,17,18,19],[20,23,20,25],[20,20,20,22],[9,20,9,22],[10,20,10,22],[11,20,11,22],[16,20,16,22],[17,20,17,22],[18,23,18,25],[19,23,19,25],[15,23,15,25],[10,23,10,25],[19,1,19,5],[6,1,7,5],[10,1,10,5],[11,1,11,5],[16,1,16,5],[17,1,17,5],[18,1,18,5],[16,29,16,32],[7,23,7,25],[7,29,7,32],[18,20,18,22],[19,20,19,22],[9,23,9,25],[8,20,8,22],[8,23,8,25],[13,20,13,22],[14,20,14,22],[15,20,15,22],[12,23,12,25],[16,33,16,35],[17,33,17,35],[18,33,18,35],[19,33,19,35],[12,1,12,5],[12,20,12,22],[7,20,7,22],[12,29,12,32],[11,23,11,25],[3,0,4,31],[3,32,4,37],[6,36,7,37],[6,20,6,35],[8,36,8,37],[9,36,9,37],[10,36,10,37],[19,36,19,37],[11,36,11,37],[7,33,7,35],[8,33,8,35],[9,33,9,35],[10,33,10,35],[11,33,11,35],[7,26,7,28],[8,26,8,28],[9,26,9,28],[10,26,10,28],[11,26,11,28],[9,29,9,32],[11,29,11,32],[10,29,10,32],[8,29,8,32],[13,29,13,32],[14,29,14,32],[15,29,15,32],[20,36,20,37],[20,26,20,28],[12,36,12,37],[15,26,15,28],[16,26,16,28],[17,26,17,28],[18,26,18,28],[19,26,19,28],[12,33,12,35],[13,33,13,35],[14,33,14,35],[20,33,20,35],[13,36,13,37],[14,36,14,37],[15,36,15,37],[16,36,16,37],[17,36,17,37],[18,36,18,37],[20,29,20,32]]}
[]
[]
[]
["HORAS EXTRAS",null,null,null,null,null,null,null,null,null,null,null,null,null,null,null,null,null,null,null,null,null,null,null,null,null,null,null,null,null,null,null,"FORMATO 6"]
[]
[]
["No.","IDENTIFICACION",null,null,null,null,"NOMBRES Y APELLIDOS COMPLETOS",null,null,null,null,null,null,null,null,null,null,"GRADO ESCALAFON",null,null,"H O R A R I O",null,null,null,null,null,null,null,null,null,null,null,null,null,null,null,"TOTAL SEMANAL"]
[null,null,null,null,null,null,null,null,null,null,null,null,null,null,null,null,null,null,null,null,"LUNES",null,null,"MARTES",null,null,"MIERCOLES",null,null,"JUEVES",null,null,null,"VIERNES"]
[1,123,null,null,null,null,"PEPITO PEREZ",null,null,null,null,null,null,null,null,null,null,{"$f":"IFERROR(VLOOKUP(B9,#REF!,3,FALSE),\"\")","v":""},null,null,null,null,null,2,null,null,1,null,null,null,null,null,null,null,null,null,{"$f":"IF(SUM(U9:AJ9)=0,\"\",SUM(U9:AJ9))","v":3}]
[2,null,null,null,null,null,{"$f":"IFERROR(VLOOKUP(B10,#REF!,2,FALSE),\"\")","v":""},null,null,null,null,null,null,null,null,null,null,{"$f":"IFERROR(VLOOKUP(B10,#REF!,3,FALSE),\"\")","v":""},null,null,null,null,null,null,null,null,null,null,null,null,null,null,null,null,null,null,{"$f":"IF(SUM(U10:AJ10)=0,\"\",SUM(U10:AJ10))","v":""}]
{"$rows_left_out":12}
{"sheet":"FORMATO 7","index":2,"n_rows":20,"n_cols":44,"rows_kept":20,"cut":false,"hidden":false,"merged":[[3,0,3,8],[4,0,4,8],[18,32,18,34],[18,35,18,38],[17,21,17,25],[17,26,17,28],[17,29,17,31],[17,32,17,34],[17,35,17,38],[14,32,14,34],[14,35,14,38],[13,21,13,25],[13,26,13,28],[13,35,13,38],[3,9,4,31],[3,32,4,38],[16,32,16,34],[16,35,16,38],[15,21,15,25],[15,26,15,28],[15,29,15,31],[15,32,15,34],[15,35,15,38],[10,35,10,38],[20,32,20,34],[19,0,19,25],[19,26,19,28],[19,29,19,31],[19,32,19,34],[19,35,19,38],[9,35,9,38],[12,21,12,25],[12,26,12,28],[12,29,12,31],[12,32,12,34],[12,35,12,38],[11,21,11,25],[11,26,11,28],[11,29,11,31],[11,32,11,34],[11,35,11,38],[18,1,18,6],[14,7,14,20],[15,7,15,20],[16,7,16,20],[17,7,17,20],[18,7,18,20],[10,21,10,25],[10,26,10,28],[10,29,10,31],[14,21,14,25],[14,26,14,28],[14,29,14,31],[18,21,18,25],[18,26,18,28],[18,29,18,31],[13,7,13,20],[13,1,13,6],[13,29,13,31],[15,1,15,6],[16,1,16,6],[17,1,17,6],[16,21,16,25],[16,26,16,28],[16,29,16,31],[6,26,6,28],[6,7,6,20],[6,21,6,25],[9,7,9,20],[10,7,10,20],[11,7,11,20],[12,7,12,20],[8,26,8,28],[6,1,6,6],[9,21,9,25],[9,26,9,28],[7,29,7,31],[7,26,7,28],[7,21,7,25],[9,1,9,6],[10,1,10,6],[11,1,11,6],[12,1,12,6],[14,1,14,6],[10,32,10,34],[13,32,13,34],[9,29,9,31],[9,32,9,34],[6,35,6,38],[6,32,6,34],[6,29,6,31],[8,29,8,31],[8,32,8,34],[8,35,8,38],[7,7,7,20],[7,1,7,6],[8,1,8,6],[8,7,8,20],[8,21,8,25],[7,35,7,38],[7,32,7,34]]}
[]
[]
[]
["MES LABORADO:",null,null,null,null,null,null,null,null,"HORAS EXTRAS",null,null,null,null,null,null,null,null,null,null,null,null,null,null,null,null,null,null,null,null,null,null,"FORMATO 7"]
["NOVIEMBRE"]
[]
["No.","IDENTIFICACION",null,null,null,null,null,"NOMBRES Y APELLIDOS COMPLETOS\n",null,null,null,null,null,null,null,null,null,null,null,null,null,null,null,null,null,null,"CONCEPTO",null,null,"TOTAL HORAS MENSUALES ASIGNADAS",null,null,"TOTAL HORAS LABORADAS  EN EL MES",null,null,"TOTAL HORAS NO LABORADAS EN EL MES",null,null,null,null,"DIAS QUE SE AUSENTO EL EMPLEADO"]
[1,{"$f":"IF('FORMATO 6'!B9:F9=0,\"\",'FORMATO 6'!B9:F9)","v":123},null,null,null,null,null,{"$f":"IF('FORMATO 6'!G9=0,\"\",'FORMATO 6'!G9)","v":"PEPITO PEREZ"},null,null,null,null,null,null,null,null,null,null,null,null,null,{"$f":"IF('FORMATO 6'!R9=0,\"\",'FORMATO 6'!R9)","v":""},null,null,null,null,{"$f":"IFERROR(VLOOKUP(V8,#REF!,3,FALSE),\"\")","v":""},null,null,{"$f":"IF($A$5='CALENDARIO 2017'!$K$3,'CALENDARIO 2017'!$M15,IF($A$5='CALENDARIO 2017'!$Q$3,'CALENDARIO 2017'!$R15,IF($A$5='CALENDARIO 2017'!$X$3,'CALENDARIO 2017'!$Y15,IF($A$5='CALENDARIO 2017'!$AE$3,'CALENDARIO 2017'!$AF15,IF($A$5='CALENDARIO 2017'!$AK$3,'CALENDARIO 2017'!$AL15,IF($A$5='CALENDARIO 2017'!$AQ$3,'CALENDARIO 2017'!$AR15,IF($A$5='CALENDARIO 2017'!$AW$3,'CALENDARIO 2017'!$AX15,IF($A$5='CALENDARIO 2017'!$BC$3,'CALENDARIO 2017'!$BD15,IF($A$5='CALENDARIO 2017'!$BI$3,'CALENDARIO 2017'!$BJ15,IF($A$5='CALENDARIO 2017'!$BO$3,'CALENDARIO 2017'!$BP15,IF($A$5='CALENDARIO 2017'!$BU$3,'CALENDARIO 2017'!$BV15,\"\")))))))))))","v":13},null,null,null,null,null,{"$f":"IF(AG8=\"\",\"\",AD8-AG8)","v":""},null,null,null,null,1,7,3,29]
[2,{"$f":"IF('FORMATO 6'!B10:F10=0,\"\",'FORMATO 6'!B10:F10)","v":""},null,null,null,null,null,{"$f":"IF('FORMATO 6'!G10=0,\"\",'FORMATO 6'!G10)","v":""},null,null,null,null,null,null,null,null,null,null,null,null,null,{"$f":"IF('FORMATO 6'!R10=0,\"\",'FORMATO 6'!R10)","v":""},null,null,null,null,{"$f":"IFERROR(VLOOKUP(V9,#REF!,3,FALSE),\"\")","v":""},null,null,{"$f":"IF($A$5='CALENDARIO 2017'!$K$3,'CALENDARIO 2017'!$M16,IF($A$5='CALENDARIO 2017'!$Q$3,'CALENDARIO 2017'!$R16,IF($A$5='CALENDARIO 2017'!$X$3,'CALENDARIO 2017'!$Y16,IF($A$5='CALENDARIO 2017'!$AE$3,'CALENDARIO 2017'!$AF16,IF($A$5='CALENDARIO 2017'!$AK$3,'CALENDARIO 2017'!$AL16,IF($A$5='CALENDARIO 2017'!$AQ$3,'CALENDARIO 2017'!$AR16,IF($A$5='CALENDARIO 2017'!$AW$3,'CALENDARIO 2017'!$AX16,IF($A$5='CALENDARIO 2017'!$BC$3,'CALENDARIO 2017'!$BD16,IF($A$5='CALENDARIO 2017'!$BI$3,'CALENDARIO 2017'!$BJ16,IF($A$5='CALENDARIO 2017'!$BO$3,'CALENDARIO 2017'!$BP16,IF($A$5='CALENDARIO 2017'!$BU$3,'CALENDARIO 2017'!$BV16,\"\")))))))))))","v":0},null,null,null,null,null,{"$f":"IF(AG9=\"\",\"\",AD9-AG9)","v":""}]
[3,{"$f":"IF('FORMATO 6'!B11:F11=0,\"\",'FORMATO 6'!B11:F11)","v":""},null,null,null,null,null,{"$f":"IF('FORMATO 6'!G11=0,\"\",'FORMATO 6'!G11)","v":""},null,null,null,null,null,null,null,null,null,null,null,null,null,{"$f":"IF('FORMATO 6'!R11=0,\"\",'FORMATO 6'!R11)","v":""},null,null,null,null,{"$f":"IFERROR(VLOOKUP(V10,#REF!,3,FALSE),\"\")","v":""},null,null,{"$f":"IF($A$5='CALENDARIO 2017'!$K$3,'CALENDARIO 2017'!$M17,IF($A$5='CALENDARIO 2017'!$Q$3,'CALENDARIO 2017'!$R17,IF($A$5='CALENDARIO 2017'!$X$3,'CALENDARIO 2017'!$Y17,IF($A$5='CALENDARIO 2017'!$AE$3,'CALENDARIO 2017'!$AF17,IF($A$5='CALENDARIO 2017'!$AK$3,'CALENDARIO 2017'!$AL17,IF($A$5='CALENDARIO 2017'!$AQ$3,'CALENDARIO 2017'!$AR17,IF($A$5='CALENDARIO 2017'!$AW$3,'CALENDARIO 2017'!$AX17,IF($A$5='CALENDARIO 2017'!$BC$3,'CALENDARIO 2017'!$BD17,IF($A$5='CALENDARIO 2017'!$BI$3,'CALENDARIO 2017'!$BJ17,IF($A$5='CALENDARIO 2017'!$BO$3,'CALENDARIO 2017'!$BP17,IF($A$5='CALENDARIO 2017'!$BU$3,'CALENDARIO 2017'!$BV17,\"\")))))))))))","v":0},null,null,null,null,null,""]
{"$rows_left_out":10}