{"text_format":"1","workbook":"xlsx","n_sheets":2,"sheets":["SOL","SOLEMI"],"not_rendered":{"charts":0,"images":0,"macros":1,"external_links":2,"defined_names":27,"comments":0,"pivot_tables":0},"unopened":[],"bounds":{"document_bytes":16777216,"sheet_cells":100000,"rows_first":2000,"rows_last":500,"rows_between":2000,"halvings":0,"cell_chars":16384,"cell_head_chars":4096},"cells_cut":0,"cells_raw":0,"read":"whole","date_system":"1900"}

{"sheet":"SOL","index":0,"n_rows":24,"n_cols":34,"rows_kept":24,"cut":false,"hidden":false,"merged":[[5,17,5,18],[4,0,4,1],[4,17,4,18],[5,0,6,0],[5,2,6,2],[5,3,6,4],[5,5,6,9],[5,10,6,10],[5,11,5,12],[5,13,5,14],[5,15,5,16],[0,0,0,5],[1,0,1,5],[2,0,2,5],[3,0,3,1],[3,2,3,9],[3,17,3,18]]}
["Teresita's Tours",null,null,null,null,null,null,null,null,null,null,null,null,null,null,null,null,null,null,"DESPROTEGIDO","AGENCIA","OB","TM","EJ","Z8","A4",null,null,{"$f":"+S2","v":10114},{"$f":"C4","v":"SOLARSA TOURS"},{"$f":"R20","v":0},{"$f":"S20","v":0},{"$f":"P20","v":67.75},{"$f":"R4","v":"00:00:00"}]
["Travel Agency & Tour Operator",null,null,null,null,null,null,null,null,null,null,null,null,null,null,null,null,"N.D. AGT Nº",10114,null,"SOLARSA TOURS",0.08,0.05,0.05,0.06,0.05]
["Sucre - Bolivia"]
["CLIENTE ",null,"SOLARSA TOURS",null,null,null,null,null,null,null,null,null,null,null,null,null,"FECHA DE IMPRESIÓN"]
["DIRECCION",null,{"$f":"IF(C4=\"\",\"\",VLOOKUP(C4,[1]CLIENTES!$A$3:$E$148,2,0))","v":"ARENALES 212"},null,null,null,null,null,null,null,null,null,null,null,null,null,"TELEFONO",{"$f":"IF(C4=\"\",\"\",VLOOKUP(C4,[1]CLIENTES!$A$3:$E$148,3,0))","v":"6439615-6439614-52661 Carlos--41727-6912030 WILLY"}]
["Nº","FECHA DE","COD","DOCUMENTO Nº",null,"RUTA Y/O SERVICIO",null,null,null,null,"PASAJER@","IMPORTE",null,"NETO",null,"COMISION",null,"NETO A PAGAR"]
[null,"EMISION",null,null,null,null,null,null,null,null,null,"BOLIVIANOS","DOLARES","BOLIVIANOS","DOLARES","BOLIVIANOS","DOLARES","BOLIVIANOS","DOLARES",null,0]
[{"$f":"IF(B8=\"\",\"\",COUNT($B$8:B8))","v":""},null,"OB",null,null,null,null,null,null,null,null,null,null,500,null,{"$f":"IF(N8=0,0,+N8*T8)","v":40},null,{"$f":"IF(L8=\"\",0,L8-P8)","v":0},{"$f":"M8-Q8","v":0},{"$f":"INDEX($V$1:$Z$2,MATCH($C$4,$U$1:$U$2,0),MATCH($C8,$V$1:$Z$1,0))","v":0.08},{"$f":"U7+1","v":1}]
[{"$f":"IF(B9=\"\",\"\",COUNT($B$8:B9))","v":""},null,"TM",null,null,null,null,null,null,null,null,null,null,255,null,{"$f":"IF(N9=0,0,+N9*T9)","v":12.75},null,{"$f":"IF(L9=\"\",0,L9-P9)","v":0},{"$f":"M9-Q9","v":0},{"$f":"INDEX($V$1:$Z$2,MATCH($C$4,$U$1:$U$2,0),MATCH($C9,$V$1:$Z$1,0))","v":0.05},{"$f":"U8+1","v":2}]
[{"$f":"IF(B10=\"\",\"\",COUNT($B$8:B10))","v":""},null,"EJ",null,null,null,null,null,null,null,null,null,null,300,null,15,null,0,0,0.05,3]
[{"$f":"IF(B11=\"\",\"\",COUNT($B$8:B11))","v":""},null,null,null,null,null,null,null,null,null,null,null,null,null,null,0,null,0,0,{"$error":"#N/A"},4]
[{"$f":"IF(B12=\"\",\"\",COUNT($B$8:B12))","v":""},null,null,null,null,null,null,null,null,null,null,null,null,null,null,0,null,0,0,{"$error":"#N/A"},5]
[{"$f":"IF(B13=\"\",\"\",COUNT($B$8:B13))","v":""},null,null,null,null,null,null,null,null,null,null,null,null,null,null,0,null,0,0,{"$error":"#N/A"},6]
[{"$f":"IF(B14=\"\",\"\",COUNT($B$8:B14))","v":""},null,null,null,null,null,null,null,null,null,null,null,null,null,null,0,null,0,0,{"$error":"#N/A"},7]
[{"$f":"IF(B15=\"\",\"\",COUNT($B$8:B15))","v":""},null,null,null,null,null,null,null,null,null,null,null,null,null,null,0,null,0,0,{"$error":"#N/A"},8]
[{"$f":"IF(B16=\"\",\"\",COUNT($B$8:B16))","v":""},null,null,null,null,null,null,null,null,null,null,null,null,null,null,0,null,0,0,{"$error":"#N/A"},9]
[{"$f":"IF(B17=\"\",\"\",COUNT($B$8:B17))","v":""},null,null,null,null,null,null,null,null,null,null,null,null,null,null,0,null,0,0,{"$error":"#N/A"},10]
[{"$f":"IF(B18=\"\",\"\",COUNT($B$8:B18))","v":""},null,null,null,null,null,null,null,null,null,null,null,null,null,null,0,null,0,0,{"$error":"#N/A"},11]
[]
[null,null,null,null,null,null,null,null,null,null,null,{"$f":"SUM(L8:L19)","v":0},0,1055,0,67.75,0,0,0]
[]
[]
["SON: 00/100 BOLIVIANOS"]
["SON: 00/100 DOLARES AMERICANOS"]

{"sheet":"SOLEMI","index":1,"n_rows":103,"n_cols":20,"rows_kept":103,"cut":false,"hidden":false,"merged":[[58,17,58,18],[57,0,57,1],[57,17,57,18],[58,0,59,0],[58,2,59,2],[58,3,59,4],[58,5,59,9],[58,10,59,10],[58,11,58,12],[58,13,58,14],[58,15,58,16],[42,17,42,18],[54,0,54,5],[55,0,55,5],[56,0,56,1],[56,2,56,9],[56,17,56,18],[41,0,41,1],[41,17,41,18],[42,0,43,0],[42,2,43,2],[42,3,43,4],[42,5,43,9],[42,10,43,10],[42,11,42,12],[42,13,42,14],[42,15,42,16],[7,17,7,18],[38,0,38,5],[39,0,39,5],[40,0,40,1],[40,2,40,9],[40,17,40,18],[6,0,6,1],[6,17,6,18],[7,0,8,0],[7,2,8,2],[7,3,8,4],[7,5,8,9],[7,10,8,10],[7,11,7,12],[7,13,7,14],[7,15,7,16],[2,0,2,5],[3,0,3,5],[4,0,4,5],[5,0,5,1],[5,2,5,9],[5,17,5,18]]}
[null,null,null,null,null,null,null,null,null,null,null,null,null,null,null,null,null,null,null,"DESPROTEGIDO"]
[]
["Teresita's Tours"]
["Travel Agency & Tour Operator",null,null,null,null,null,null,null,null,null,null,null,null,null,null,null,null,"N.D. AGT Nº",10113]
["Sucre - Bolivia"]
["CLIENTE ",null,"SOLARSA TOURS",null,null,null,null,null,null,null,null,null,null,null,null,null,"FECHA DE IMPRESIÓN","2016-03-12"]
["DIRECCION",null,{"$f":"IF(C6=\"\",\"\",VLOOKUP(C6,[1]CLIENTES!$A$3:$E$148,2,0))","v":"ARENALES 212"},null,null,null,null,null,null,null,null,null,null,null,null,null,"TELEFONO",{"$f":"IF(C6=\"\",\"\",VLOOKUP(C6,[1]CLIENTES!$A$3:$E$148,3,0))","v":"6439615-6439614-52661 Carlos--41727-6912030 WILLY"}]
["Nº","FECHA DE","COD","DOCUMENTO Nº",null,"RUTA Y/O SERVICIO",null,null,null,null,"PASAJER@","IMPORTE",null,"NETO",null,"COMISION",null,"NETO A PAGAR"]
[null,"EMISION",null,null,null,null,null,null,null,null,null,"BOLIVIANOS","DOLARES","BOLIVIANOS","DOLARES","BOLIVIANOS","DOLARES","BOLIVIANOS","DOLARES"]
[1,"2016-03-07","OB",930,1727262830,"SRE","CBB","SRE",null,null,"CHURRUARRIN ALVARO",404,0,326,0,26.080000000000002,null,377.92,0]
[2,"2016-03-07","OB",930,1727262833,"SRE","CBB",null,null,null,"MOSCOSO VERONICA",195,0,163,0,13.040000000000001,null,181.96,0]
[3,"2016-03-07","OB",930,1727262861,"SRE","LPB","SRE",null,null,"LAREDO SERGIO",857,0,706,0,56.480000000000004,null,800.52,0]
[4,"2016-03-07","OB",930,1727262864,"SRE","LPB","SRE",null,null,"LEREDO IVAN",857,0,706,0,56.480000000000004,null,800.52,0]
[5,"2016-03-08","OB",930,1727267537,"SRE","CBB","SRE",null,null,"BEJARANO ELSA VICTORIA",505,0,411,0,32.880000000000003,null,472.12,0]
[6,"2016-03-08","OB",930,1727267562,"SRE","CBB","SRE",null,null,"DURAN MANUEL",459,0,372,0,29.76,null,429.24,0]
[7,"2016-03-08","OB",930,1727267568,"CBB","SRE",null,null,null,"DAZA HERMELINDA",210,0,163,0,13.040000000000001,null,196.96,0]
[8,"2016-03-08","OB",930,1727267572,"SRE","LPB","SRE",null,null,"DAZA HERMELINDA",590,0,482,0,38.56,null,551.44000000000005,0]
[9,"2016-03-08","OB",930,1727267573,"SRE","LPB","SRE",null,null,"TORREZ FERNANDO",590,0,482,0,38.56,null,551.44000000000005,0]
[10,"2016-03-09","TM",0,8430960,"SRE","CBB",null,null,null,"POGGI BORDA ROXANA",234,0,197,0,9.8500000000000014,null,224.15,0]
[11,"2016-03-09","OB",930,1727267589,"SRE","LPB",null,null,null,"BARRIENTOS CRISTINA",333,0,279,0,22.32,null,310.68,0]
[12,"2016-03-09","OB",930,1727273673,"SRE","VVI",null,null,null,"ESPINOZA ANDREA",279,0,233,0,18.64,null,260.36,0]
[13,"2016-03-09","OB",930,1727273674,"SRE","VVI",null,null,null,"FLORES JOSE",279,0,233,0,18.64,null,260.36,0]
[14,"2016-03-09","OB",930,1727273675,"SRE","VVI",null,null,null,"FLORES ESPINOZA FALOMNACH NATALY",188,0,157,0,12.56,null,175.44,0]
[15,"2016-03-09","OB",930,1727273684,"SRE","CBB","SRE",null,null,"SOLARES PATRICIA",441,0,357,0,28.560000000000002,null,412.44,0]
[16,"2016-03-09","OB",930,1727273686,"SRE","CBB","SRE",null,null,"MIRANDA ALDO",441,0,357,0,28.560000000000002,null,412.44,0]
[17,"2016-03-09","OB",930,1727273687,"SRE","CBB","SRE",null,null,"MIRANDA SOLARES ALEGRA",45,0,37,0,2.96,null,42.04,0]
[18,"2016-03-09","OB",930,1727273688,"SRE","CBB","SRE",null,null,"MIRANDA SOLARES AURORA",323,0,258,0,20.64,null,302.36,0]
[19,"2016-03-09","OB",930,1727273694,"CBB","SRE",null,null,null,"POGGI ROXANA",210,0,163,0,13.040000000000001,null,196.96,0]
[20,"2016-03-10","TM",0,8432940,"SRE","CBB","SRZ",null,null,"WIEBE WIEBE JOHAN",240,0,202,0,10.100000000000001,null,229.9,0]
[21,"2016-03-11","EJ",0,1266728,"SRE","CBB",null,null,null,"HEREDIA CABERO LUIS ARNALDO",280,0,235,0,11.75,null,268.25,0]
[22,"2016-03-11","OB",930,1727279085,"SRE","CBB",null,null,null,"MOSCOSO VERONICA",296,0,248,0,19.84,null,276.16000000000003,0]
[23,"2016-03-11","OB",930,1727279086,"CBB","SRE",null,null,null,"MOSCOSO VERONICA",210,0,163,0,13.040000000000001,null,196.96,0]
[24,"2016-03-11","OB",930,1727279091,"CBB","SRE",null,null,null,"HEREDIA LUIS",210,0,163,0,13.040000000000001,null,196.96,0]
[25,"2016-03-12","TM",0,8435983,"SRE","CBB",null,null,null,"POGGI BORDA ROXANA",30,0,30,0,1.5,null,28.5,0]
[26,"2016-03-12","OB",930,1727279103,"LPB","SRE",null,null,null,"CABALLERO MICHEL MARIA INGRID",303,0,241,0,19.28,null,283.72000000000003,0]
[null,null,null,null,null,null,null,null,null,null,null,9009,0,7364,0,569.19999999999993,0,8439.7999999999975,0]
["SON:  OCHO MIL CUATROCIENTOS TREINTA Y NUEVE  80/100 BOLIVIANOS"]
["SON:   00/100 DOLARES AMERICANOS"]
["Travel Agency & Tour Operator",null,null,null,null,null,null,null,null,null,null,null,null,null,null,null,null,"N.D. AGT Nº",10112]
["Sucre - Bolivia"]
["CLIENTE ",null,"SOLARSA TOURS",null,null,null,null,null,null,null,null,null,null,null,null,null,"FECHA DE IMPRESIÓN","2016-03-06"]
["DIRECCION",null,{"$f":"IF(C41=\"\",\"\",VLOOKUP(C41,[1]CLIENTES!$A$3:$E$148,2,0))","v":"ARENALES 212"},null,null,null,null,null,null,null,null,null,null,null,null,null,"TELEFONO",{"$f":"IF(C41=\"\",\"\",VLOOKUP(C41,[1]CLIENTES!$A$3:$E$148,3,0))","v":"6439615-6439614-52661 Carlos--41727-6912030 WILLY"}]
["Nº","FECHA DE","COD","DOCUMENTO Nº",null,"RUTA Y/O SERVICIO",null,null,null,null,"PASAJER@","IMPORTE",null,"NETO",null,"COMISION",null,"NETO A PAGAR"]
[null,"EMISION",null,null,null,null,null,null,null,null,null,"BOLIVIANOS","DOLARES","BOLIVIANOS","DOLARES","BOLIVIANOS","DOLARES","BOLIVIANOS","DOLARES"]
[1,"2016-03-01","Z8",464,4185611645,"SRE","PLB","SRE",null,null,"ROMERO SERGIO",986,0,816,0,48.96,null,937.04,0]
[2,"2016-03-02","OB",930,1661651200,"CBB","SRE",null,null,null,"SALARES PATRICIA",246,0,194,0,15.52,null,230.48,0]
[3,"2016-03-02","OB",930,1661651201,"CBB","SRE",null,null,null,"MIRANDA SOLARES ALEGRA",25,0,20,0,1.6,null,23.4,0]
[4,"2016-03-02","OB",930,1661651202,"SRE","CBB",null,null,null,"SOLARES PATRICIA",343,0,287,0,22.96,null,320.04000000000002,0]
[5,"2016-03-02","OB",930,1661651203,"SRE","CBB",null,null,null,"MIRANDA SOLARES ALEGRA",35,0,29,0,2.3199999999999998,null,32.68,0]
[6,"2016-03-03","EJ",0,1255761,"CBB","SRE",null,null,null,"MOSCOSO ROMERO VERONICA",278,0,221,0,11.05,null,266.95,0]
[7,"2016-03-03","TM",0,8423369,"SRE","CBB",null,null,null,"DAZA HERMELINDA",252,0,212,0,10.600000000000001,null,241.4,0]
[null,null,null,null,null,null,null,null,null,null,null,2165,0,1779,0,113.00999999999999,0,2051.9900000000002,0]
["SON:  DOS MIL CINCUENTA Y UN  99/100 BOLIVIANOS"]
["SON:   00/100 DOLARES AMERICANOS"]
["Travel Agency & Tour Operator",null,null,null,null,null,null,null,null,null,null,null,null,null,null,null,null,"N.D. AGT Nº",10111]
["Sucre - Bolivia"]
["CLIENTE ",null,"SOLARSA TOURS",null,null,null,null,null,null,null,null,null,null,null,null,null,"FECHA DE IMPRESIÓN","2016-02-29"]
["DIRECCION",null,{"$f":"IF(C57=\"\",\"\",VLOOKUP(C57,[1]CLIENTES!$A$3:$E$148,2,0))","v":"ARENALES 212"},null,null,null,null,null,null,null,null,null,null,null,null,null,"TELEFONO",{"$f":"IF(C57=\"\",\"\",VLOOKUP(C57,[1]CLIENTES!$A$3:$E$148,3,0))","v":"6439615-6439614-52661 Carlos--41727-6912030 WILLY"}]
["Nº","FECHA DE","COD","DOCUMENTO Nº",null,"RUTA Y/O SERVICIO",null,null,null,null,"PASAJER@","IMPORTE",null,"NETO",null,"COMISION",null,"NETO A PAGAR"]
[null,"EMISION",null,null,null,null,null,null,null,null,null,"BOLIVIANOS","DOLARES","BOLIVIANOS","DOLARES","BOLIVIANOS","DOLARES","BOLIVIANOS","DOLARES"]
[1,"2016-02-22","TM",0,8407244,"SRE","CBB",null,null,null,"GUTIERREZ PAEZ JHONNY ",216,0,181,0,9.0500000000000007,null,206.95,0]
[2,"2016-02-22","TM",0,8407245,"SRE","CBB",null,null,null,"GUTIERREZ PAEZ LYLY ALEJANDRA ",216,0,181,0,9.0500000000000007,null,206.95,0]
[3,"2016-02-22","TM",0,8407246,"SRE","CBB",null,null,null,"GUTIERREZ PAEZ MACEDONIO RAMIRO ",216,0,181,0,9.0500000000000007,null,206.95,0]
[4,"2016-02-22","TM",0,8407367,"SRE","SRZ",null,null,null,"CALDERON SOLIZ ERIKA ",320,0,269,0,13.450000000000001,null,306.55,0]
[5,"2016-02-22","OB",930,1661625192,"SRE","VVI","SRE",null,null,"BURGOS BLACUT ROSA ",552,0,450,0,36,null,516,0]
[6,"2016-02-23","OB",930,1661633464,"SRE","CBB","SRE",null,null,"DURAN MANUEL ",459,0,372,0,29.76,null,429.24,0]
[7,"2016-02-23","OB",930,1661633470,"SRE","VVI",null,null,null,"ASTETE WILMER ",400,0,336,0,26.88,null,373.12,0]
[8,"2016-02-23","OB",930,1661633475,"CBB","SRE",null,null,null,"MIRANDA ALDO ",246,0,194,0,15.52,null,230.48,0]
[9,"2016-02-23","OB",930,1661633476,"CBB","SRE",null,null,null,"SOLARES PATRICIA",246,0,194,0,15.52,null,230.48,0]
[10,"2016-02-23","OB",930,1661633477,"CBB","SRE",null,null,null,"MIRANDA SOLARES ALEGRA ",25,0,20,0,1.6,null,23.4,0]
[11,"2016-02-24","EJ",0,1244980,"SRE","SRZ",null,null,null,"HUISA MAMANI SONIA",362,0,304,0,15.200000000000001,null,346.8,0]
[12,"2016-02-24","EJ",0,1244981,"SRE","SRZ",null,null,null,"VERBO PACO MARIA",362,0,304,0,15.200000000000001,null,346.8,0]
[13,"2016-02-24","TM",0,8410243,"SRE","SRZ",null,null,null,"RAMIREZ NICOLAS",400,0,336,0,16.8,null,383.2,0]
[14,"2016-02-24","TM",0,8410803,"SRZ","SRE",null,null,null,"RAMIREZ NICOLAS",320,0,269,0,13.450000000000001,null,306.55,0]
[15,"2016-02-24","TM",0,8410946,"SRZ","SRE",null,null,null,"SEJAS YUCRA OKINBER",320,0,269,0,13.450000000000001,null,306.55,0]
[16,"2016-02-24","TM",0,8411025,"SRZ","SRE",null,null,null,"FERNANDEZ REYNAGA RUSLAN ORLANDO",320,0,269,0,13.450000000000001,null,306.55,0]
[17,"2016-02-25","TM",0,8412968,"SRE","SRZ",null,null,null,"CALDERON FELIX",240,0,202,0,10.100000000000001,null,229.9,0]
[18,"2016-02-25","TM",0,8412969,"SRE","SRZ",null,null,null,"CALDERON ANGEL",320,0,269,0,13.450000000000001,null,306.55,0]
[19,"2016-02-25","OB",930,1661633519,"VVI","SRE",null,null,null,"ARANDIA RILBER",294,0,233,0,18.64,null,275.36,0]
[20,"2016-02-25","Z8",464,4185611619,"SRE","VVI",null,null,null,"ARANDIA RILBER",391,0,328,0,19.68,null,371.32,0]
[21,"2016-02-26","EJ",0,1247981,"SRE","SRZ",null,null,null,"NEUFELD DE GUENTHER ELIZABETH",402,0,338,0,16.900000000000002,null,385.1,0]
[22,"2016-02-26","EJ",0,1247982,"SRE","SRZ",null,null,null,"GUENTIER GUENTIER JOHAN",402,0,338,0,16.900000000000002,null,385.1,0]
[23,"2016-02-26","EJ",0,1247983,"SRE","SRZ",null,null,null,"BUHLER PENNER WILHEM",402,0,338,0,16.900000000000002,null,385.1,0]
[24,"2016-02-26","EJ",0,1247984,"SRE","SRZ",null,null,null,"GUENTIER GUENTIER BARBARA",402,0,338,0,16.900000000000002,null,385.1,0]
[25,"2016-02-26","EJ",0,1247985,"SRE","SRZ",null,null,null,"BUHLER GUENTIER SARA",40,0,34,0,1.7000000000000002,null,38.299999999999997,0]
[26,"2016-02-26","TM",0,8415306,"SRE","CBB",null,null,null,"POGGI ROXANA",252,0,212,0,10.600000000000001,null,241.4,0]
[27,"2016-02-26","OB",930,1661633527,"SRE","CBB",null,null,null,"LEY LAURA URSULA",367,0,308,0,24.64,null,342.36,0]
[28,"2016-02-26","OB",930,1661633528,"CBB","TDD",null,null,null,"LEY LAURA URSULA",327,0,261,0,20.88,null,306.12,0]
[29,"2016-02-26","OB",930,1661633534,"SRE","CBB",null,null,null,"MOSCOSO ROMERO VERONICA",343,0,287,0,22.96,null,320.04000000000002,0]
[30,"2016-02-26","OB",930,1661633546,"CBB","LPB",null,null,null,"POGGI ROXANA",257,0,202,0,16.16,null,240.84,0]
[31,"2016-02-26","Z8",464,4185611622,"SRE","LPB","SRE",null,null,"PUENTE LUIS",986,0,816,0,48.96,null,937.04,0]
[32,"2016-02-26","Z8",464,4185611624,"SRE","VVI","SRE",null,null,"PUENTE LUIS ",771,0,635,0,38.1,null,732.9,0]
[33,"2016-02-26","Z8",464,4185611628,"LPB","SRE",null,null,null,"POGGI ROXANA ",568,0,464,0,27.84,null,540.16,0]
[34,"2016-02-27","TM",0,8415699,"SRE","CBB","LPB",null,null,"CALANI JAVIER",416,0,349,0,17.45,null,398.55,0]
[35,"2016-02-27","TM",0,8415701,"SRE","CBB","LPB",null,null,"MORA CARLOS",416,0,349,0,17.45,null,398.55,0]
[36,"2016-02-27","TM",0,8415703,"SRE","CBB","LPB",null,null,"CANAZA ANGEL",416,0,349,0,17.45,null,398.55,0]
[37,"2016-02-27","OB",930,1661642965,"LPB","UYU",null,null,null,"MERCADO MARISELA",660,0,541,0,43.28,null,616.72,0]
[38,"2016-02-27","Z8",464,4185611630,"UYU","LPB",null,null,null,"MERCADO MARISELA",744,0,625,0,37.5,null,706.5,0]
[39,"2016-02-29","EJ",0,1250029,"SRE","SRZ",null,null,null,"CARDONA LINARES YENNY LIDSY",322,0,270,0,13.5,null,308.5,0]
[40,"2016-02-29","OB",930,1661642972,"SRE","CBB","SRE",null,null,"DURAN MANUEL",459,0,372,0,29.76,null,429.24,0]
[null,null,null,null,null,null,null,null,null,null,null,15177,0,12587,0,771.13,0,14405.869999999997,0]
["SON:  CATORCE MIL CUATROCIENTOS CINCO  87/100 BOLIVIANOS"]
["SON:   00/100 DOLARES AMERICANOS"]