{"text_format":"1","workbook":"xlsx","n_sheets":3,"sheets":["Buscador","Hoja1","inventario"],"not_rendered":{"charts":0,"images":2,"macros":1,"external_links":0,"defined_names":3,"comments":0,"pivot_tables":0},"unopened":[],"bounds":{"document_bytes":16777216,"sheet_cells":100000,"rows_first":2000,"rows_last":500,"rows_between":2000,"halvings":0,"cell_chars":16384,"cell_head_chars":4096},"cells_cut":0,"cells_raw":0,"read":"whole","date_system":"1900"}

{"sheet":"Buscador","index":0,"n_rows":11,"n_cols":3,"rows_kept":11,"cut":false,"hidden":false,"merged":[]}
[]
[]
[]
[]
[]
[null,"Código","CS00023"]
[null,"Producto",{"$f":"VLOOKUP(C6,inventario!$A$2:$F$177,2,FALSE)","v":"Aeronave con 4 hélices y Gimbal Protector"}]
[null,"Referencia",{"$f":"VLOOKUP(C6,inventario!$A$2:$F$177,3,FALSE)","v":"Mavic Air"}]
[null,"Cantidad",{"$f":"VLOOKUP(C6,inventario!$A$2:$F$177,4,FALSE)","v":1}]
[null,"Estado",{"$f":"VLOOKUP(C6,inventario!$A$2:$F$177,5,FALSE)","v":"Excelente"}]
[null,"Lugar de almacenamiento",{"$f":"VLOOKUP(C6,inventario!$A$2:$F$177,6,FALSE)","v":0}]

{"sheet":"Hoja1","index":1,"n_rows":11,"n_cols":3,"rows_kept":11,"cut":false,"hidden":false,"merged":[]}
[]
[]
[]
[]
[]
[null,"Código",""]
[null,"Producto"]
[null,"Referencia"]
[null,"Cantidad"]
[null,"Estado"]
[null,"Lugar de almacenamiento"]

{"sheet":"inventario","index":2,"n_rows":39,"n_cols":8,"rows_kept":39,"cut":false,"hidden":false,"merged":[]}
["Código","Descripción","Referencia","Cantidad","Estado","Lugar de almacenamiento",2,"<-------Fila"]
["CS00001","Cámara Digital D7000","  Nikon  ",1,"Bueno",null,{"$f":"nFILA-1","v":1},"<-------Código"]
["CS00002","Cargador cámara D700","  Nikon MH-25  ",1,"Excelente"]
["CS00003","Maletin Negro grande para cámara","  Lowepro  ",1,"Excelente"]
["CS00004","Cámara Digital D5300","  Nikon  ",1,"Excelente"]
["CS00005","Lente AF-5 Nikkor 18-105mm","  Nikon  ",1,"Excelente"]
["CS00006","Lente AF-P Nikkor 18-55mm","  Nikon  ",1,"Excelente"]
["CS00007","Cargador cámara D5300","  Nikon MH-24  ",1,"Excelente"]
["CS00008","Cable USB UC-E17","  Nikon D5300  ",1,"Excelente","Caja de cámara"]
["CS00009","Cable de audio/vídeo EG-CP16","  Nikon D5300  ",1,"Excelente","Caja de cámara"]
["CS00010","Tapa de la zapata de accesorios BS-1","  Nikon D5300  ",1,"Excelente","Caja de cámara"]
["CS00011","Tapa del ocular DK-5","  Nikon D5300  ",1,"Excelente","Caja de cámara"]
["CS00012","Maletin Negro pequeño para cárama","  Nikon D5300  ",1,"Excelente","Caja de cámara"]
["CS00013","Cámara 360","  Samsung  ",1,"Excelente"]
["CS00014","Monopodo","  Yunteng No.1505256576  ",1,"Excelente"]
["CS00015","Tripode","  Vanguard  ",1,"Excelente"]
["CS00016","Tascam","  DR-40 Version 2  ",1,"Excelente"]
["CS00017","Cable USB DR-40","Tascam",1,"Excelente","Caja de la tascam"]
["CS00018","Tilt Foot","Tascam",1,"Excelente","Caja de la tascam"]
["CS00019","Memoria micro SD 4GB","Tascam",1,"Excelente","Dentro de la tascam"]
["CS00020","Memoria expandible 64 GB","SandDisk Ultra Sdx ush-l card",1,"Excelente","Bolsa de micrófonos"]
["CS00021","Memoria expandible 64 GB","SandDisk Ultra Sdx ush-l card",1,"Excelente"]
["CS00022","Memoria expandible 16 GB","FlashAir Toshiba",1,"Excelente","Bolsa de micrófonos"]
["CS00023","Aeronave con 4 hélices y Gimbal Protector","Mavic Air",1,"Excelente"]
["CS00024","Estuche aeronave","Mavic Air",1,"Excelente"]
["CS00025","Hélices de respuesto","Mavic Air",1,"Excelente","Cables y respuestos "]
["CS00026","Cable USB-C 3.0","Mavic Air",1,"Excelente","Cables y respuestos "]
["CS00027","Cables RC","Mavic Air",2,"Excelente","Cables y respuestos "]
["CS00028","Palancas de repuesto para control remoto de aeronave","Mavic Air",4,"Excelente","Cables y respuestos "]
["CS00029","Protectores para hélices","Mavic Air",4,"Excelente","Bolsa de viaje"]
["CS00030","Control remoto con 2 palancas y cable RC","Mavic Air",1,"Excelente","Bolsa de viaje"]
["CS00031","Adapatador de alimentación CA","Mavic Air",1,"Excelente","Bolsa de viaje"]
["CS00032","Cable de alimentación de CA","Mavic Air",1,"Excelente","Bolsa de viaje"]
["CS00033","Centro de carga de batería","Mavic Air",1,"Excelente","Bolsa de viaje"]
["CS00034","Batería de vuelo inteligente","Mavic Air",3,"Excelente","Bolsa de viaje"]
["CS00035","Adaptador de alimentación de batería a batería externa","Mavic Air",1,"Excelente","Bolsa de viaje"]
["CS00036","Bolsa de viaje - Equipamiento Drone","Mavic Air",1,"Excelente"]
["CS00037","Micrófono de Solapa Boya","Boya BY-M1",1,"Bueno"]
["CS00038"]