{"text_format":"1","workbook":"xlsx","n_sheets":6,"sheets":["Pautas","Hoja1","Rentabilidad por Plazas","Tabla cant Elementos","Detalle Ingreso-Egreso","Tablas"],"not_rendered":{"charts":0,"images":0,"macros":1,"external_links":2,"defined_names":7,"comments":0,"pivot_tables":0},"unopened":[],"bounds":{"document_bytes":16777216,"sheet_cells":100000,"rows_first":2000,"rows_last":500,"rows_between":2000,"halvings":0,"cell_chars":16384,"cell_head_chars":4096},"cells_cut":0,"cells_raw":0,"read":"whole","date_system":"1900"}

{"sheet":"Pautas","index":0,"n_rows":32,"n_cols":35,"rows_kept":32,"cut":false,"hidden":false,"merged":[]}
["H. Ruta","Listados","Envio List","Pauta (con rojo tiene Listado)","Cliente (con rojo Tiene Hoja de Ruta)","Telco","Localidad (con Naranja no propias)","Tipo de Elemento","Cantidad vendida","Cantidad a Fijar","Robada","Costo Unitario","Costo Total","% de ag.","Importe de confidenc.","Fecha de Inicio","Fecha Finalizacion","Cantidad de Dias","Mes de Facturacion","Empresa Fijadora","Importe de Compra","Cantidad Comprada","Ejecutivo de Venta","Empresa que vendio",null,null,null,"Localidad","Empresa Fijadora","Elementos","Ejecutivo de Venta","Empresa que vendio","Sextuples","Hiperformatos","Carteleras"]
[null,null,null,null,null,null,null,null,null,null,null,null,null,null,null,null,null,null,null,null,null,null,null,null,null,null,null,"Posadas","Bona SRL","Carteleras","Ferro","Soporte",250,1500,7]
[null,null,null,null,null,null,null,null,null,null,null,null,null,null,null,null,null,null,null,null,null,null,null,null,null,null,null,"Corrientes","Pedro Gramajo","Sextuples","Vannucci","Bona",420]
[null,null,null,null,null,null,null,null,null,null,null,null,null,null,null,null,null,null,null,null,null,null,null,null,null,null,null,"Resistencia","Omar Gimenez","Hiperformatos","Monterzino",null,420]
[null,null,null,null,null,null,null,null,null,null,null,null,null,null,null,null,null,null,null,null,null,null,null,null,null,null,null,"Jujuy","72 DPI srl","Espectacular","Soporte",null,420]
[null,null,null,null,null,null,null,null,null,null,null,null,null,null,null,null,null,null,null,null,null,null,null,null,null,null,null,"Salta","Multimarketing","Produccion","Bonacina",null,350,4500]
[null,null,null,null,null,null,null,null,null,null,null,null,null,null,null,null,null,null,null,null,null,null,null,null,null,null,null,"Tucuman","Grupo Marka","Leds","Alvarez",null,520]
[null,null,null,null,null,null,null,null,null,null,null,null,null,null,null,null,null,null,null,null,null,null,null,null,null,null,null,"Capital federal","Cristian Batueca",null,"Cilander"]
[null,null,null,null,null,null,null,null,null,null,null,null,null,null,null,null,null,null,null,null,null,null,null,null,null,"T",0,"Santiago del Estero","Cobertura",null,null,null,450]
[null,null,null,null,null,null,null,null,null,null,null,null,null,null,null,null,null,null,null,null,null,null,null,null,null,null,0.1,"Catamarca","Imagen Publicitaria",null,null,null,420,7000,15.6]
[null,null,null,null,null,null,null,null,null,null,null,null,null,null,null,null,null,null,null,null,null,null,null,null,null,null,0.15,"San Juan","Bustamante",null,null,null,320,5000,15]
[null,null,null,null,null,null,null,null,null,null,null,null,null,null,null,null,null,null,null,null,null,null,null,null,null,null,0.2,"La Rioja","Americo Gimenez",null,null,null,300]
[null,null,null,null,null,null,null,null,null,null,null,null,null,null,null,null,null,null,null,null,null,null,null,null,null,null,null,"General Roca","Cono sur",null,null,null,null,null,12]
[null,null,null,null,null,null,null,null,null,null,null,null,null,null,null,null,null,null,null,null,null,null,null,null,null,null,null,"Neuquen","Activa",null,null,null,380]
[null,null,null,null,null,null,null,null,null,null,null,null,null,null,null,null,null,null,null,null,null,null,null,null,null,null,null,"Santa Rosa","Grupo Gea",null,null,null,520]
[null,null,null,null,null,null,null,null,null,null,null,null,null,null,null,null,null,null,null,null,null,null,null,null,null,null,null,"Bahia Blanca","Via Publica Patagonica",null,null,null,750]
[null,null,null,null,null,null,null,null,null,null,null,null,null,null,null,null,null,null,null,null,null,null,null,null,null,null,null,"Cordoba","Imprenta"]
[null,null,null,null,null,null,null,null,null,null,null,null,null,null,null,null,null,null,null,null,null,null,null,null,null,null,null,"Mendoza","Alexander",null,null,null,320]
[null,null,null,null,null,null,null,null,null,null,null,null,null,null,null,null,null,null,null,null,null,null,null,null,null,null,null,"Rosario","Nexo s.r.l."]
[null,null,null,null,null,null,null,null,null,null,null,null,null,null,null,null,null,null,null,null,null,null,null,null,null,null,null,"Santa Fe","H2O"]
[null,null,null,null,null,null,null,null,null,null,null,null,null,null,null,null,null,null,null,null,null,null,null,null,null,null,null,"Parana","Fabian Sodja",null,null,null,390,null,15]
[null,null,null,null,null,null,null,null,null,null,null,null,null,null,null,null,null,null,null,null,null,null,null,null,null,null,null,"Mar del Plata","Victor Monterzino",null,null,null,100,500,5]
[null,null,null,null,null,null,null,null,null,null,null,null,null,null,null,null,null,null,null,null,null,null,null,null,null,null,null,"Trelew","Grupo BDM",null,null,null,450]
[null,null,null,null,null,null,null,null,null,null,null,null,null,null,null,null,null,null,null,null,null,null,null,null,null,null,null,"Comodoro R.","GB Via Publica"]
[null,null,null,null,null,null,null,null,null,null,null,null,null,null,null,null,null,null,null,null,null,null,null,null,null,null,null,"San Luis","Soporte"]
[null,null,null,null,null,null,null,null,null,null,null,null,null,null,null,null,null,null,null,null,null,null,null,null,null,null,null,"Carlos Paz","Gustavo Genini"]
[null,null,null,null,null,null,null,null,null,null,null,null,null,null,null,null,null,null,null,null,null,null,null,null,null,null,null,null,"Joaquien Dufour",null,null,null,380,null,15]
[null,null,null,null,null,null,null,null,null,null,null,null,null,null,null,null,null,null,null,null,null,null,null,null,null,null,null,null,"Martin Vieyra",null,null,null,400]
[null,null,null,null,null,null,null,null,null,null,null,null,null,null,null,null,null,null,null,null,null,null,null,null,null,null,null,null,"Fernandez leandro",null,null,null,450,4000,15]
[null,null,null,null,null,null,null,null,null,null,null,null,null,null,null,null,null,null,null,null,null,null,null,null,null,null,null,null,"Activa vp"]
[null,null,null,null,null,null,null,null,null,null,null,null,null,null,null,null,null,null,null,null,null,null,null,null,null,null,null,null,"Big Media"]
[null,null,null,null,null,null,null,null,null,null,null,null,null,null,null,null,null,null,null,null,null,null,null,null,null,null,null,null,"Tesis"]

{"sheet":"Hoja1","index":1,"n_rows":14,"n_cols":49,"rows_kept":14,"cut":false,"hidden":true,"merged":[]}
[null,{"$f":"+#REF!","v":{"$error":"#REF!"}},{"$f":"+B1+1","v":{"$error":"#REF!"}},{"$f":"+C1+1","v":{"$error":"#REF!"}},{"$error":"#REF!"},{"$error":"#REF!"},{"$error":"#REF!"},{"$error":"#REF!"},{"$error":"#REF!"},{"$error":"#REF!"},{"$error":"#REF!"},{"$error":"#REF!"},{"$error":"#REF!"},{"$error":"#REF!"},{"$error":"#REF!"},{"$error":"#REF!"},{"$error":"#REF!"},{"$error":"#REF!"},{"$error":"#REF!"},{"$error":"#REF!"},{"$error":"#REF!"},{"$error":"#REF!"},{"$error":"#REF!"},{"$error":"#REF!"},{"$error":"#REF!"},{"$error":"#REF!"},{"$error":"#REF!"},{"$error":"#REF!"},{"$error":"#REF!"},{"$error":"#REF!"},{"$error":"#REF!"},{"$error":"#REF!"},{"$error":"#REF!"},{"$error":"#REF!"},{"$error":"#REF!"},{"$error":"#REF!"},{"$error":"#REF!"},{"$error":"#REF!"},{"$error":"#REF!"},{"$error":"#REF!"},{"$error":"#REF!"},{"$error":"#REF!"},{"$error":"#REF!"},{"$error":"#REF!"},{"$error":"#REF!"},{"$error":"#REF!"},{"$error":"#REF!"},{"$error":"#REF!"},{"$error":"#REF!"}]
["Posadas",{"$f":"+#REF!","v":{"$error":"#REF!"}},{"$f":"+#REF!","v":{"$error":"#REF!"}},{"$f":"+#REF!","v":{"$error":"#REF!"}},{"$f":"+#REF!","v":{"$error":"#REF!"}},{"$f":"+#REF!","v":{"$error":"#REF!"}},{"$f":"+#REF!","v":{"$error":"#REF!"}},{"$f":"+#REF!","v":{"$error":"#REF!"}},{"$f":"+#REF!","v":{"$error":"#REF!"}},{"$f":"+#REF!","v":{"$error":"#REF!"}},{"$f":"+#REF!","v":{"$error":"#REF!"}},{"$f":"+#REF!","v":{"$error":"#REF!"}},{"$f":"+#REF!","v":{"$error":"#REF!"}},{"$f":"+#REF!","v":{"$error":"#REF!"}},{"$f":"+#REF!","v":{"$error":"#REF!"}},{"$f":"+#REF!","v":{"$error":"#REF!"}},{"$f":"+#REF!","v":{"$error":"#REF!"}},{"$f":"+#REF!","v":{"$error":"#REF!"}},{"$f":"+#REF!","v":{"$error":"#REF!"}},{"$f":"+#REF!","v":{"$error":"#REF!"}},{"$f":"+#REF!","v":{"$error":"#REF!"}},{"$f":"+#REF!","v":{"$error":"#REF!"}},{"$f":"+#REF!","v":{"$error":"#REF!"}},{"$f":"+#REF!","v":{"$error":"#REF!"}},{"$f":"+#REF!","v":{"$error":"#REF!"}},{"$f":"+#REF!","v":{"$error":"#REF!"}},{"$f":"+#REF!","v":{"$error":"#REF!"}},{"$f":"+#REF!","v":{"$error":"#REF!"}},{"$f":"+#REF!","v":{"$error":"#REF!"}},{"$f":"+#REF!","v":{"$error":"#REF!"}},{"$f":"+#REF!","v":{"$error":"#REF!"}},{"$f":"+#REF!","v":{"$error":"#REF!"}},{"$f":"+#REF!","v":{"$error":"#REF!"}},{"$f":"+#REF!","v":{"$error":"#REF!"}},{"$f":"+#REF!","v":{"$error":"#REF!"}},{"$f":"+#REF!","v":{"$error":"#REF!"}},{"$f":"+#REF!","v":{"$error":"#REF!"}},{"$f":"+#REF!","v":{"$error":"#REF!"}},{"$f":"+#REF!","v":{"$error":"#REF!"}},{"$f":"+#REF!","v":{"$error":"#REF!"}},{"$f":"+#REF!","v":{"$error":"#REF!"}},{"$f":"+#REF!","v":{"$error":"#REF!"}},{"$f":"+#REF!","v":{"$error":"#REF!"}},{"$f":"+#REF!","v":{"$error":"#REF!"}},{"$f":"+#REF!","v":{"$error":"#REF!"}},{"$f":"+#REF!","v":{"$error":"#REF!"}},{"$f":"+#REF!","v":{"$error":"#REF!"}},{"$f":"+#REF!","v":{"$error":"#REF!"}},{"$f":"+#REF!","v":{"$error":"#REF!"}}]
["Corrientes",{"$f":"+#REF!","v":{"$error":"#REF!"}},{"$f":"+#REF!","v":{"$error":"#REF!"}},{"$f":"+#REF!","v":{"$error":"#REF!"}},{"$f":"+#REF!","v":{"$error":"#REF!"}},{"$f":"+#REF!","v":{"$error":"#REF!"}},{"$f":"+#REF!","v":{"$error":"#REF!"}},{"$f":"+#REF!","v":{"$error":"#REF!"}},{"$f":"+#REF!","v":{"$error":"#REF!"}},{"$f":"+#REF!","v":{"$error":"#REF!"}},{"$f":"+#REF!","v":{"$error":"#REF!"}},{"$f":"+#REF!","v":{"$error":"#REF!"}},{"$f":"+#REF!","v":{"$error":"#REF!"}},{"$f":"+#REF!","v":{"$error":"#REF!"}},{"$f":"+#REF!","v":{"$error":"#REF!"}},{"$f":"+#REF!","v":{"$error":"#REF!"}},{"$f":"+#REF!","v":{"$error":"#REF!"}},{"$f":"+#REF!","v":{"$error":"#REF!"}},{"$f":"+#REF!","v":{"$error":"#REF!"}},{"$f":"+#REF!","v":{"$error":"#REF!"}},{"$f":"+#REF!","v":{"$error":"#REF!"}},{"$f":"+#REF!","v":{"$error":"#REF!"}},{"$f":"+#REF!","v":{"$error":"#REF!"}},{"$f":"+#REF!","v":{"$error":"#REF!"}},{"$f":"+#REF!","v":{"$error":"#REF!"}},{"$f":"+#REF!","v":{"$error":"#REF!"}},{"$f":"+#REF!","v":{"$error":"#REF!"}},{"$f":"+#REF!","v":{"$error":"#REF!"}},{"$f":"+#REF!","v":{"$error":"#REF!"}},{"$f":"+#REF!","v":{"$error":"#REF!"}},{"$f":"+#REF!","v":{"$error":"#REF!"}},{"$f":"+#REF!","v":{"$error":"#REF!"}},{"$f":"+#REF!","v":{"$error":"#REF!"}},{"$f":"+#REF!","v":{"$error":"#REF!"}},{"$f":"+#REF!","v":{"$error":"#REF!"}},{"$f":"+#REF!","v":{"$error":"#REF!"}},{"$f":"+#REF!","v":{"$error":"#REF!"}},{"$f":"+#REF!","v":{"$error":"#REF!"}},{"$f":"+#REF!","v":{"$error":"#REF!"}},{"$f":"+#REF!","v":{"$error":"#REF!"}},{"$f":"+#REF!","v":{"$error":"#REF!"}},{"$f":"+#REF!","v":{"$error":"#REF!"}},{"$f":"+#REF!","v":{"$error":"#REF!"}},{"$f":"+#REF!","v":{"$error":"#REF!"}},{"$f":"+#REF!","v":{"$error":"#REF!"}},{"$f":"+#REF!","v":{"$error":"#REF!"}},{"$f":"+#REF!","v":{"$error":"#REF!"}},{"$f":"+#REF!","v":{"$error":"#REF!"}},{"$f":"+#REF!","v":{"$error":"#REF!"}}]
["Resistencia",{"$f":"+#REF!","v":{"$error":"#REF!"}},{"$f":"+#REF!","v":{"$error":"#REF!"}},{"$f":"+#REF!","v":{"$error":"#REF!"}},{"$f":"+#REF!","v":{"$error":"#REF!"}},{"$f":"+#REF!","v":{"$error":"#REF!"}},{"$f":"+#REF!","v":{"$error":"#REF!"}},{"$f":"+#REF!","v":{"$error":"#REF!"}},{"$f":"+#REF!","v":{"$error":"#REF!"}},{"$f":"+#REF!","v":{"$error":"#REF!"}},{"$f":"+#REF!","v":{"$error":"#REF!"}},{"$f":"+#REF!","v":{"$error":"#REF!"}},{"$f":"+#REF!","v":{"$error":"#REF!"}},{"$f":"+#REF!","v":{"$error":"#REF!"}},{"$f":"+#REF!","v":{"$error":"#REF!"}},{"$f":"+#REF!","v":{"$error":"#REF!"}},{"$f":"+#REF!","v":{"$error":"#REF!"}},{"$f":"+#REF!","v":{"$error":"#REF!"}},{"$f":"+#REF!","v":{"$error":"#REF!"}},{"$f":"+#REF!","v":{"$error":"#REF!"}},{"$f":"+#REF!","v":{"$error":"#REF!"}},{"$f":"+#REF!","v":{"$error":"#REF!"}},{"$f":"+#REF!","v":{"$error":"#REF!"}},{"$f":"+#REF!","v":{"$error":"#REF!"}},{"$f":"+#REF!","v":{"$error":"#REF!"}},{"$f":"+#REF!","v":{"$error":"#REF!"}},{"$f":"+#REF!","v":{"$error":"#REF!"}},{"$f":"+#REF!","v":{"$error":"#REF!"}},{"$f":"+#REF!","v":{"$error":"#REF!"}},{"$f":"+#REF!","v":{"$error":"#REF!"}},{"$f":"+#REF!","v":{"$error":"#REF!"}},{"$f":"+#REF!","v":{"$error":"#REF!"}},{"$f":"+#REF!","v":{"$error":"#REF!"}},{"$f":"+#REF!","v":{"$error":"#REF!"}},{"$f":"+#REF!","v":{"$error":"#REF!"}},{"$f":"+#REF!","v":{"$error":"#REF!"}},{"$f":"+#REF!","v":{"$error":"#REF!"}},{"$f":"+#REF!","v":{"$error":"#REF!"}},{"$f":"+#REF!","v":{"$error":"#REF!"}},{"$f":"+#REF!","v":{"$error":"#REF!"}},{"$f":"+#REF!","v":{"$error":"#REF!"}},{"$f":"+#REF!","v":{"$error":"#REF!"}},{"$f":"+#REF!","v":{"$error":"#REF!"}},{"$f":"+#REF!","v":{"$error":"#REF!"}},{"$f":"+#REF!","v":{"$error":"#REF!"}},{"$f":"+#REF!","v":{"$error":"#REF!"}},{"$f":"+#REF!","v":{"$error":"#REF!"}},{"$f":"+#REF!","v":{"$error":"#REF!"}},{"$f":"+#REF!","v":{"$error":"#REF!"}}]
["Jujuy",{"$f":"+#REF!","v":{"$error":"#REF!"}},{"$f":"+#REF!","v":{"$error":"#REF!"}},{"$f":"+#REF!","v":{"$error":"#REF!"}},{"$f":"+#REF!","v":{"$error":"#REF!"}},{"$f":"+#REF!","v":{"$error":"#REF!"}},{"$f":"+#REF!","v":{"$error":"#REF!"}},{"$f":"+#REF!","v":{"$error":"#REF!"}},{"$f":"+#REF!","v":{"$error":"#REF!"}},{"$f":"+#REF!","v":{"$error":"#REF!"}},{"$f":"+#REF!","v":{"$error":"#REF!"}},{"$f":"+#REF!","v":{"$error":"#REF!"}},{"$f":"+#REF!","v":{"$error":"#REF!"}},{"$f":"+#REF!","v":{"$error":"#REF!"}},{"$f":"+#REF!","v":{"$error":"#REF!"}},{"$f":"+#REF!","v":{"$error":"#REF!"}},{"$f":"+#REF!","v":{"$error":"#REF!"}},{"$f":"+#REF!","v":{"$error":"#REF!"}},{"$f":"+#REF!","v":{"$error":"#REF!"}},{"$f":"+#REF!","v":{"$error":"#REF!"}},{"$f":"+#REF!","v":{"$error":"#REF!"}},{"$f":"+#REF!","v":{"$error":"#REF!"}},{"$f":"+#REF!","v":{"$error":"#REF!"}},{"$f":"+#REF!","v":{"$error":"#REF!"}},{"$f":"+#REF!","v":{"$error":"#REF!"}},{"$f":"+#REF!","v":{"$error":"#REF!"}},{"$f":"+#REF!","v":{"$error":"#REF!"}},{"$f":"+#REF!","v":{"$error":"#REF!"}},{"$f":"+#REF!","v":{"$error":"#REF!"}},{"$f":"+#REF!","v":{"$error":"#REF!"}},{"$f":"+#REF!","v":{"$error":"#REF!"}},{"$f":"+#REF!","v":{"$error":"#REF!"}},{"$f":"+#REF!","v":{"$error":"#REF!"}},{"$f":"+#REF!","v":{"$error":"#REF!"}},{"$f":"+#REF!","v":{"$error":"#REF!"}},{"$f":"+#REF!","v":{"$error":"#REF!"}},{"$f":"+#REF!","v":{"$error":"#REF!"}},{"$f":"+#REF!","v":{"$error":"#REF!"}},{"$f":"+#REF!","v":{"$error":"#REF!"}},{"$f":"+#REF!","v":{"$error":"#REF!"}},{"$f":"+#REF!","v":{"$error":"#REF!"}},{"$f":"+#REF!","v":{"$error":"#REF!"}},{"$f":"+#REF!","v":{"$error":"#REF!"}},{"$f":"+#REF!","v":{"$error":"#REF!"}},{"$f":"+#REF!","v":{"$error":"#REF!"}},{"$f":"+#REF!","v":{"$error":"#REF!"}},{"$f":"+#REF!","v":{"$error":"#REF!"}},{"$f":"+#REF!","v":{"$error":"#REF!"}},{"$f":"+#REF!","v":{"$error":"#REF!"}}]
["Salta",{"$f":"+#REF!","v":{"$error":"#REF!"}},{"$f":"+#REF!","v":{"$error":"#REF!"}},{"$f":"+#REF!","v":{"$error":"#REF!"}},{"$f":"+#REF!","v":{"$error":"#REF!"}},{"$f":"+#REF!","v":{"$error":"#REF!"}},{"$f":"+#REF!","v":{"$error":"#REF!"}},{"$f":"+#REF!","v":{"$error":"#REF!"}},{"$f":"+#REF!","v":{"$error":"#REF!"}},{"$f":"+#REF!","v":{"$error":"#REF!"}},{"$f":"+#REF!","v":{"$error":"#REF!"}},{"$f":"+#REF!","v":{"$error":"#REF!"}},{"$f":"+#REF!","v":{"$error":"#REF!"}},{"$f":"+#REF!","v":{"$error":"#REF!"}},{"$f":"+#REF!","v":{"$error":"#REF!"}},{"$f":"+#REF!","v":{"$error":"#REF!"}},{"$f":"+#REF!","v":{"$error":"#REF!"}},{"$f":"+#REF!","v":{"$error":"#REF!"}},{"$f":"+#REF!","v":{"$error":"#REF!"}},{"$f":"+#REF!","v":{"$error":"#REF!"}},{"$f":"+#REF!","v":{"$error":"#REF!"}},{"$f":"+#REF!","v":{"$error":"#REF!"}},{"$f":"+#REF!","v":{"$error":"#REF!"}},{"$f":"+#REF!","v":{"$error":"#REF!"}},{"$f":"+#REF!","v":{"$error":"#REF!"}},{"$f":"+#REF!","v":{"$error":"#REF!"}},{"$f":"+#REF!","v":{"$error":"#REF!"}},{"$f":"+#REF!","v":{"$error":"#REF!"}},{"$f":"+#REF!","v":{"$error":"#REF!"}},{"$f":"+#REF!","v":{"$error":"#REF!"}},{"$f":"+#REF!","v":{"$error":"#REF!"}},{"$f":"+#REF!","v":{"$error":"#REF!"}},{"$f":"+#REF!","v":{"$error":"#REF!"}},{"$f":"+#REF!","v":{"$error":"#REF!"}},{"$f":"+#REF!","v":{"$error":"#REF!"}},{"$f":"+#REF!","v":{"$error":"#REF!"}},{"$f":"+#REF!","v":{"$error":"#REF!"}},{"$f":"+#REF!","v":{"$error":"#REF!"}},{"$f":"+#REF!","v":{"$error":"#REF!"}},{"$f":"+#REF!","v":{"$error":"#REF!"}},{"$f":"+#REF!","v":{"$error":"#REF!"}},{"$f":"+#REF!","v":{"$error":"#REF!"}},{"$f":"+#REF!","v":{"$error":"#REF!"}},{"$f":"+#REF!","v":{"$error":"#REF!"}},{"$f":"+#REF!","v":{"$error":"#REF!"}},{"$f":"+#REF!","v":{"$error":"#REF!"}},{"$f":"+#REF!","v":{"$error":"#REF!"}},{"$f":"+#REF!","v":{"$error":"#REF!"}},{"$f":"+#REF!","v":{"$error":"#REF!"}}]
["Tucuman",{"$f":"+#REF!","v":{"$error":"#REF!"}},{"$f":"+#REF!","v":{"$error":"#REF!"}},{"$f":"+#REF!","v":{"$error":"#REF!"}},{"$f":"+#REF!","v":{"$error":"#REF!"}},{"$f":"+#REF!","v":{"$error":"#REF!"}},{"$f":"+#REF!","v":{"$error":"#REF!"}},{"$f":"+#REF!","v":{"$error":"#REF!"}},{"$f":"+#REF!","v":{"$error":"#REF!"}},{"$f":"+#REF!","v":{"$error":"#REF!"}},{"$f":"+#REF!","v":{"$error":"#REF!"}},{"$f":"+#REF!","v":{"$error":"#REF!"}},{"$f":"+#REF!","v":{"$error":"#REF!"}},{"$f":"+#REF!","v":{"$error":"#REF!"}},{"$f":"+#REF!","v":{"$error":"#REF!"}},{"$f":"+#REF!","v":{"$error":"#REF!"}},{"$f":"+#REF!","v":{"$error":"#REF!"}},{"$f":"+#REF!","v":{"$error":"#REF!"}},{"$f":"+#REF!","v":{"$error":"#REF!"}},{"$f":"+#REF!","v":{"$error":"#REF!"}},{"$f":"+#REF!","v":{"$error":"#REF!"}},{"$f":"+#REF!","v":{"$error":"#REF!"}},{"$f":"+#REF!","v":{"$error":"#REF!"}},{"$f":"+#REF!","v":{"$error":"#REF!"}},{"$f":"+#REF!","v":{"$error":"#REF!"}},{"$f":"+#REF!","v":{"$error":"#REF!"}},{"$f":"+#REF!","v":{"$error":"#REF!"}},{"$f":"+#REF!","v":{"$error":"#REF!"}},{"$f":"+#REF!","v":{"$error":"#REF!"}},{"$f":"+#REF!","v":{"$error":"#REF!"}},{"$f":"+#REF!","v":{"$error":"#REF!"}},{"$f":"+#REF!","v":{"$error":"#REF!"}},{"$f":"+#REF!","v":{"$error":"#REF!"}},{"$f":"+#REF!","v":{"$error":"#REF!"}},{"$f":"+#REF!","v":{"$error":"#REF!"}},{"$f":"+#REF!","v":{"$error":"#REF!"}},{"$f":"+#REF!","v":{"$error":"#REF!"}},{"$f":"+#REF!","v":{"$error":"#REF!"}},{"$f":"+#REF!","v":{"$error":"#REF!"}},{"$f":"+#REF!","v":{"$error":"#REF!"}},{"$f":"+#REF!","v":{"$error":"#REF!"}},{"$f":"+#REF!","v":{"$error":"#REF!"}},{"$f":"+#REF!","v":{"$error":"#REF!"}},{"$f":"+#REF!","v":{"$error":"#REF!"}},{"$f":"+#REF!","v":{"$error":"#REF!"}},{"$f":"+#REF!","v":{"$error":"#REF!"}},{"$f":"+#REF!","v":{"$error":"#REF!"}},{"$f":"+#REF!","v":{"$error":"#REF!"}},{"$f":"+#REF!","v":{"$error":"#REF!"}}]
["Santiago del Estero",{"$f":"+#REF!","v":{"$error":"#REF!"}},{"$f":"+#REF!","v":{"$error":"#REF!"}},{"$f":"+#REF!","v":{"$error":"#REF!"}},{"$f":"+#REF!","v":{"$error":"#REF!"}},{"$f":"+#REF!","v":{"$error":"#REF!"}},{"$f":"+#REF!","v":{"$error":"#REF!"}},{"$f":"+#REF!","v":{"$error":"#REF!"}},{"$f":"+#REF!","v":{"$error":"#REF!"}},{"$f":"+#REF!","v":{"$error":"#REF!"}},{"$f":"+#REF!","v":{"$error":"#REF!"}},{"$f":"+#REF!","v":{"$error":"#REF!"}},{"$f":"+#REF!","v":{"$error":"#REF!"}},{"$f":"+#REF!","v":{"$error":"#REF!"}},{"$f":"+#REF!","v":{"$error":"#REF!"}},{"$f":"+#REF!","v":{"$error":"#REF!"}},{"$f":"+#REF!","v":{"$error":"#REF!"}},{"$f":"+#REF!","v":{"$error":"#REF!"}},{"$f":"+#REF!","v":{"$error":"#REF!"}},{"$f":"+#REF!","v":{"$error":"#REF!"}},{"$f":"+#REF!","v":{"$error":"#REF!"}},{"$f":"+#REF!","v":{"$error":"#REF!"}},{"$f":"+#REF!","v":{"$error":"#REF!"}},{"$f":"+#REF!","v":{"$error":"#REF!"}},{"$f":"+#REF!","v":{"$error":"#REF!"}},{"$f":"+#REF!","v":{"$error":"#REF!"}},{"$f":"+#REF!","v":{"$error":"#REF!"}},{"$f":"+#REF!","v":{"$error":"#REF!"}},{"$f":"+#REF!","v":{"$error":"#REF!"}},{"$f":"+#REF!","v":{"$error":"#REF!"}},{"$f":"+#REF!","v":{"$error":"#REF!"}},{"$f":"+#REF!","v":{"$error":"#REF!"}},{"$f":"+#REF!","v":{"$error":"#REF!"}},{"$f":"+#REF!","v":{"$error":"#REF!"}},{"$f":"+#REF!","v":{"$error":"#REF!"}},{"$f":"+#REF!","v":{"$error":"#REF!"}},{"$f":"+#REF!","v":{"$error":"#REF!"}},{"$f":"+#REF!","v":{"$error":"#REF!"}},{"$f":"+#REF!","v":{"$error":"#REF!"}},{"$f":"+#REF!","v":{"$error":"#REF!"}},{"$f":"+#REF!","v":{"$error":"#REF!"}},{"$f":"+#REF!","v":{"$error":"#REF!"}},{"$f":"+#REF!","v":{"$error":"#REF!"}},{"$f":"+#REF!","v":{"$error":"#REF!"}},{"$f":"+#REF!","v":{"$error":"#REF!"}},{"$f":"+#REF!","v":{"$error":"#REF!"}},{"$f":"+#REF!","v":{"$error":"#REF!"}},{"$f":"+#REF!","v":{"$error":"#REF!"}},{"$f":"+#REF!","v":{"$error":"#REF!"}}]
["Catamarca",{"$f":"+#REF!","v":{"$error":"#REF!"}},{"$f":"+#REF!","v":{"$error":"#REF!"}},{"$f":"+#REF!","v":{"$error":"#REF!"}},{"$f":"+#REF!","v":{"$error":"#REF!"}},{"$f":"+#REF!","v":{"$error":"#REF!"}},{"$f":"+#REF!","v":{"$error":"#REF!"}},{"$f":"+#REF!","v":{"$error":"#REF!"}},{"$f":"+#REF!","v":{"$error":"#REF!"}},{"$f":"+#REF!","v":{"$error":"#REF!"}},{"$f":"+#REF!","v":{"$error":"#REF!"}},{"$f":"+#REF!","v":{"$error":"#REF!"}},{"$f":"+#REF!","v":{"$error":"#REF!"}},{"$f":"+#REF!","v":{"$error":"#REF!"}},{"$f":"+#REF!","v":{"$error":"#REF!"}},{"$f":"+#REF!","v":{"$error":"#REF!"}},{"$f":"+#REF!","v":{"$error":"#REF!"}},{"$f":"+#REF!","v":{"$error":"#REF!"}},{"$f":"+#REF!","v":{"$error":"#REF!"}},{"$f":"+#REF!","v":{"$error":"#REF!"}},{"$f":"+#REF!","v":{"$error":"#REF!"}},{"$f":"+#REF!","v":{"$error":"#REF!"}},{"$f":"+#REF!","v":{"$error":"#REF!"}},{"$f":"+#REF!","v":{"$error":"#REF!"}},{"$f":"+#REF!","v":{"$error":"#REF!"}},{"$f":"+#REF!","v":{"$error":"#REF!"}},{"$f":"+#REF!","v":{"$error":"#REF!"}},{"$f":"+#REF!","v":{"$error":"#REF!"}},{"$f":"+#REF!","v":{"$error":"#REF!"}},{"$f":"+#REF!","v":{"$error":"#REF!"}},{"$f":"+#REF!","v":{"$error":"#REF!"}},{"$f":"+#REF!","v":{"$error":"#REF!"}},{"$f":"+#REF!","v":{"$error":"#REF!"}},{"$f":"+#REF!","v":{"$error":"#REF!"}},{"$f":"+#REF!","v":{"$error":"#REF!"}},{"$f":"+#REF!","v":{"$error":"#REF!"}},{"$f":"+#REF!","v":{"$error":"#REF!"}},{"$f":"+#REF!","v":{"$error":"#REF!"}},{"$f":"+#REF!","v":{"$error":"#REF!"}},{"$f":"+#REF!","v":{"$error":"#REF!"}},{"$f":"+#REF!","v":{"$error":"#REF!"}},{"$f":"+#REF!","v":{"$error":"#REF!"}},{"$f":"+#REF!","v":{"$error":"#REF!"}},{"$f":"+#REF!","v":{"$error":"#REF!"}},{"$f":"+#REF!","v":{"$error":"#REF!"}},{"$f":"+#REF!","v":{"$error":"#REF!"}},{"$f":"+#REF!","v":{"$error":"#REF!"}},{"$f":"+#REF!","v":{"$error":"#REF!"}},{"$f":"+#REF!","v":{"$error":"#REF!"}}]
["La Rioja",{"$f":"+#REF!","v":{"$error":"#REF!"}},{"$f":"+#REF!","v":{"$error":"#REF!"}},{"$f":"+#REF!","v":{"$error":"#REF!"}},{"$f":"+#REF!","v":{"$error":"#REF!"}},{"$f":"+#REF!","v":{"$error":"#REF!"}},{"$f":"+#REF!","v":{"$error":"#REF!"}},{"$f":"+#REF!","v":{"$error":"#REF!"}},{"$f":"+#REF!","v":{"$error":"#REF!"}},{"$f":"+#REF!","v":{"$error":"#REF!"}},{"$f":"+#REF!","v":{"$error":"#REF!"}},{"$f":"+#REF!","v":{"$error":"#REF!"}},{"$f":"+#REF!","v":{"$error":"#REF!"}},{"$f":"+#REF!","v":{"$error":"#REF!"}},{"$f":"+#REF!","v":{"$error":"#REF!"}},{"$f":"+#REF!","v":{"$error":"#REF!"}},{"$f":"+#REF!","v":{"$error":"#REF!"}},{"$f":"+#REF!","v":{"$error":"#REF!"}},{"$f":"+#REF!","v":{"$error":"#REF!"}},{"$f":"+#REF!","v":{"$error":"#REF!"}},{"$f":"+#REF!","v":{"$error":"#REF!"}},{"$f":"+#REF!","v":{"$error":"#REF!"}},{"$f":"+#REF!","v":{"$error":"#REF!"}},{"$f":"+#REF!","v":{"$error":"#REF!"}},{"$f":"+#REF!","v":{"$error":"#REF!"}},{"$f":"+#REF!","v":{"$error":"#REF!"}},{"$f":"+#REF!","v":{"$error":"#REF!"}},{"$f":"+#REF!","v":{"$error":"#REF!"}},{"$f":"+#REF!","v":{"$error":"#REF!"}},{"$f":"+#REF!","v":{"$error":"#REF!"}},{"$f":"+#REF!","v":{"$error":"#REF!"}},{"$f":"+#REF!","v":{"$error":"#REF!"}},{"$f":"+#REF!","v":{"$error":"#REF!"}},{"$f":"+#REF!","v":{"$error":"#REF!"}},{"$f":"+#REF!","v":{"$error":"#REF!"}},{"$f":"+#REF!","v":{"$error":"#REF!"}},{"$f":"+#REF!","v":{"$error":"#REF!"}},{"$f":"+#REF!","v":{"$error":"#REF!"}},{"$f":"+#REF!","v":{"$error":"#REF!"}},{"$f":"+#REF!","v":{"$error":"#REF!"}},{"$f":"+#REF!","v":{"$error":"#REF!"}},{"$f":"+#REF!","v":{"$error":"#REF!"}},{"$f":"+#REF!","v":{"$error":"#REF!"}},{"$f":"+#REF!","v":{"$error":"#REF!"}},{"$f":"+#REF!","v":{"$error":"#REF!"}},{"$f":"+#REF!","v":{"$error":"#REF!"}},{"$f":"+#REF!","v":{"$error":"#REF!"}},{"$f":"+#REF!","v":{"$error":"#REF!"}},{"$f":"+#REF!","v":{"$error":"#REF!"}}]
["San Juan",{"$f":"+#REF!","v":{"$error":"#REF!"}},{"$f":"+#REF!","v":{"$error":"#REF!"}},{"$f":"+#REF!","v":{"$error":"#REF!"}},{"$f":"+#REF!","v":{"$error":"#REF!"}},{"$f":"+#REF!","v":{"$error":"#REF!"}},{"$f":"+#REF!","v":{"$error":"#REF!"}},{"$f":"+#REF!","v":{"$error":"#REF!"}},{"$f":"+#REF!","v":{"$error":"#REF!"}},{"$f":"+#REF!","v":{"$error":"#REF!"}},{"$f":"+#REF!","v":{"$error":"#REF!"}},{"$f":"+#REF!","v":{"$error":"#REF!"}},{"$f":"+#REF!","v":{"$error":"#REF!"}},{"$f":"+#REF!","v":{"$error":"#REF!"}},{"$f":"+#REF!","v":{"$error":"#REF!"}},{"$f":"+#REF!","v":{"$error":"#REF!"}},{"$f":"+#REF!","v":{"$error":"#REF!"}},{"$f":"+#REF!","v":{"$error":"#REF!"}},{"$f":"+#REF!","v":{"$error":"#REF!"}},{"$f":"+#REF!","v":{"$error":"#REF!"}},{"$f":"+#REF!","v":{"$error":"#REF!"}},{"$f":"+#REF!","v":{"$error":"#REF!"}},{"$f":"+#REF!","v":{"$error":"#REF!"}},{"$f":"+#REF!","v":{"$error":"#REF!"}},{"$f":"+#REF!","v":{"$error":"#REF!"}},{"$f":"+#REF!","v":{"$error":"#REF!"}},{"$f":"+#REF!","v":{"$error":"#REF!"}},{"$f":"+#REF!","v":{"$error":"#REF!"}},{"$f":"+#REF!","v":{"$error":"#REF!"}},{"$f":"+#REF!","v":{"$error":"#REF!"}},{"$f":"+#REF!","v":{"$error":"#REF!"}},{"$f":"+#REF!","v":{"$error":"#REF!"}},{"$f":"+#REF!","v":{"$error":"#REF!"}},{"$f":"+#REF!","v":{"$error":"#REF!"}},{"$f":"+#REF!","v":{"$error":"#REF!"}},{"$f":"+#REF!","v":{"$error":"#REF!"}},{"$f":"+#REF!","v":{"$error":"#REF!"}},{"$f":"+#REF!","v":{"$error":"#REF!"}},{"$f":"+#REF!","v":{"$error":"#REF!"}},{"$f":"+#REF!","v":{"$error":"#REF!"}},{"$f":"+#REF!","v":{"$error":"#REF!"}},{"$f":"+#REF!","v":{"$error":"#REF!"}},{"$f":"+#REF!","v":{"$error":"#REF!"}},{"$f":"+#REF!","v":{"$error":"#REF!"}},{"$f":"+#REF!","v":{"$error":"#REF!"}},{"$f":"+#REF!","v":{"$error":"#REF!"}},{"$f":"+#REF!","v":{"$error":"#REF!"}},{"$f":"+#REF!","v":{"$error":"#REF!"}},{"$f":"+#REF!","v":{"$error":"#REF!"}}]
["Neuquen",{"$f":"+#REF!","v":{"$error":"#REF!"}},{"$f":"+#REF!","v":{"$error":"#REF!"}},{"$f":"+#REF!","v":{"$error":"#REF!"}},{"$f":"+#REF!","v":{"$error":"#REF!"}},{"$f":"+#REF!","v":{"$error":"#REF!"}},{"$f":"+#REF!","v":{"$error":"#REF!"}},{"$f":"+#REF!","v":{"$error":"#REF!"}},{"$f":"+#REF!","v":{"$error":"#REF!"}},{"$f":"+#REF!","v":{"$error":"#REF!"}},{"$f":"+#REF!","v":{"$error":"#REF!"}},{"$f":"+#REF!","v":{"$error":"#REF!"}},{"$f":"+#REF!","v":{"$error":"#REF!"}},{"$f":"+#REF!","v":{"$error":"#REF!"}},{"$f":"+#REF!","v":{"$error":"#REF!"}},{"$f":"+#REF!","v":{"$error":"#REF!"}},{"$f":"+#REF!","v":{"$error":"#REF!"}},{"$f":"+#REF!","v":{"$error":"#REF!"}},{"$f":"+#REF!","v":{"$error":"#REF!"}},{"$f":"+#REF!","v":{"$error":"#REF!"}},{"$f":"+#REF!","v":{"$error":"#REF!"}},{"$f":"+#REF!","v":{"$error":"#REF!"}},{"$f":"+#REF!","v":{"$error":"#REF!"}},{"$f":"+#REF!","v":{"$error":"#REF!"}},{"$f":"+#REF!","v":{"$error":"#REF!"}},{"$f":"+#REF!","v":{"$error":"#REF!"}},{"$f":"+#REF!","v":{"$error":"#REF!"}},{"$f":"+#REF!","v":{"$error":"#REF!"}},{"$f":"+#REF!","v":{"$error":"#REF!"}},{"$f":"+#REF!","v":{"$error":"#REF!"}},{"$f":"+#REF!","v":{"$error":"#REF!"}},{"$f":"+#REF!","v":{"$error":"#REF!"}},{"$f":"+#REF!","v":{"$error":"#REF!"}},{"$f":"+#REF!","v":{"$error":"#REF!"}},{"$f":"+#REF!","v":{"$error":"#REF!"}},{"$f":"+#REF!","v":{"$error":"#REF!"}},{"$f":"+#REF!","v":{"$error":"#REF!"}},{"$f":"+#REF!","v":{"$error":"#REF!"}},{"$f":"+#REF!","v":{"$error":"#REF!"}},{"$f":"+#REF!","v":{"$error":"#REF!"}},{"$f":"+#REF!","v":{"$error":"#REF!"}},{"$f":"+#REF!","v":{"$error":"#REF!"}},{"$f":"+#REF!","v":{"$error":"#REF!"}},{"$f":"+#REF!","v":{"$error":"#REF!"}},{"$f":"+#REF!","v":{"$error":"#REF!"}},{"$f":"+#REF!","v":{"$error":"#REF!"}},{"$f":"+#REF!","v":{"$error":"#REF!"}},{"$f":"+#REF!","v":{"$error":"#REF!"}},{"$f":"+#REF!","v":{"$error":"#REF!"}}]
["Santa Rosa",{"$f":"+#REF!","v":{"$error":"#REF!"}},{"$f":"+#REF!","v":{"$error":"#REF!"}},{"$f":"+#REF!","v":{"$error":"#REF!"}},{"$f":"+#REF!","v":{"$error":"#REF!"}},{"$f":"+#REF!","v":{"$error":"#REF!"}},{"$f":"+#REF!","v":{"$error":"#REF!"}},{"$f":"+#REF!","v":{"$error":"#REF!"}},{"$f":"+#REF!","v":{"$error":"#REF!"}},{"$f":"+#REF!","v":{"$error":"#REF!"}},{"$f":"+#REF!","v":{"$error":"#REF!"}},{"$f":"+#REF!","v":{"$error":"#REF!"}},{"$f":"+#REF!","v":{"$error":"#REF!"}},{"$f":"+#REF!","v":{"$error":"#REF!"}},{"$f":"+#REF!","v":{"$error":"#REF!"}},{"$f":"+#REF!","v":{"$error":"#REF!"}},{"$f":"+#REF!","v":{"$error":"#REF!"}},{"$f":"+#REF!","v":{"$error":"#REF!"}},{"$f":"+#REF!","v":{"$error":"#REF!"}},{"$f":"+#REF!","v":{"$error":"#REF!"}},{"$f":"+#REF!","v":{"$error":"#REF!"}},{"$f":"+#REF!","v":{"$error":"#REF!"}},{"$f":"+#REF!","v":{"$error":"#REF!"}},{"$f":"+#REF!","v":{"$error":"#REF!"}},{"$f":"+#REF!","v":{"$error":"#REF!"}},{"$f":"+#REF!","v":{"$error":"#REF!"}},{"$f":"+#REF!","v":{"$error":"#REF!"}},{"$f":"+#REF!","v":{"$error":"#REF!"}},{"$f":"+#REF!","v":{"$error":"#REF!"}},{"$f":"+#REF!","v":{"$error":"#REF!"}},{"$f":"+#REF!","v":{"$error":"#REF!"}},{"$f":"+#REF!","v":{"$error":"#REF!"}},{"$f":"+#REF!","v":{"$error":"#REF!"}},{"$f":"+#REF!","v":{"$error":"#REF!"}},{"$f":"+#REF!","v":{"$error":"#REF!"}},{"$f":"+#REF!","v":{"$error":"#REF!"}},{"$f":"+#REF!","v":{"$error":"#REF!"}},{"$f":"+#REF!","v":{"$error":"#REF!"}},{"$f":"+#REF!","v":{"$error":"#REF!"}},{"$f":"+#REF!","v":{"$error":"#REF!"}},{"$f":"+#REF!","v":{"$error":"#REF!"}},{"$f":"+#REF!","v":{"$error":"#REF!"}},{"$f":"+#REF!","v":{"$error":"#REF!"}},{"$f":"+#REF!","v":{"$error":"#REF!"}},{"$f":"+#REF!","v":{"$error":"#REF!"}},{"$f":"+#REF!","v":{"$error":"#REF!"}},{"$f":"+#REF!","v":{"$error":"#REF!"}},{"$f":"+#REF!","v":{"$error":"#REF!"}},{"$f":"+#REF!","v":{"$error":"#REF!"}}]
["Bahia Blanca",{"$f":"+#REF!","v":{"$error":"#REF!"}},{"$f":"+#REF!","v":{"$error":"#REF!"}},{"$f":"+#REF!","v":{"$error":"#REF!"}},{"$f":"+#REF!","v":{"$error":"#REF!"}},{"$f":"+#REF!","v":{"$error":"#REF!"}},{"$f":"+#REF!","v":{"$error":"#REF!"}},{"$f":"+#REF!","v":{"$error":"#REF!"}},{"$f":"+#REF!","v":{"$error":"#REF!"}},{"$f":"+#REF!","v":{"$error":"#REF!"}},{"$f":"+#REF!","v":{"$error":"#REF!"}},{"$f":"+#REF!","v":{"$error":"#REF!"}},{"$f":"+#REF!","v":{"$error":"#REF!"}},{"$f":"+#REF!","v":{"$error":"#REF!"}},{"$f":"+#REF!","v":{"$error":"#REF!"}},{"$f":"+#REF!","v":{"$error":"#REF!"}},{"$f":"+#REF!","v":{"$error":"#REF!"}},{"$f":"+#REF!","v":{"$error":"#REF!"}},{"$f":"+#REF!","v":{"$error":"#REF!"}},{"$f":"+#REF!","v":{"$error":"#REF!"}},{"$f":"+#REF!","v":{"$error":"#REF!"}},{"$f":"+#REF!","v":{"$error":"#REF!"}},{"$f":"+#REF!","v":{"$error":"#REF!"}},{"$f":"+#REF!","v":{"$error":"#REF!"}},{"$f":"+#REF!","v":{"$error":"#REF!"}},{"$f":"+#REF!","v":{"$error":"#REF!"}},{"$f":"+#REF!","v":{"$error":"#REF!"}},{"$f":"+#REF!","v":{"$error":"#REF!"}},{"$f":"+#REF!","v":{"$error":"#REF!"}},{"$f":"+#REF!","v":{"$error":"#REF!"}},{"$f":"+#REF!","v":{"$error":"#REF!"}},{"$f":"+#REF!","v":{"$error":"#REF!"}},{"$f":"+#REF!","v":{"$error":"#REF!"}},{"$f":"+#REF!","v":{"$error":"#REF!"}},{"$f":"+#REF!","v":{"$error":"#REF!"}},{"$f":"+#REF!","v":{"$error":"#REF!"}},{"$f":"+#REF!","v":{"$error":"#REF!"}},{"$f":"+#REF!","v":{"$error":"#REF!"}},{"$f":"+#REF!","v":{"$error":"#REF!"}},{"$f":"+#REF!","v":{"$error":"#REF!"}},{"$f":"+#REF!","v":{"$error":"#REF!"}},{"$f":"+#REF!","v":{"$error":"#REF!"}},{"$f":"+#REF!","v":{"$error":"#REF!"}},{"$f":"+#REF!","v":{"$error":"#REF!"}},{"$f":"+#REF!","v":{"$error":"#REF!"}},{"$f":"+#REF!","v":{"$error":"#REF!"}},{"$f":"+#REF!","v":{"$error":"#REF!"}},{"$f":"+#REF!","v":{"$error":"#REF!"}},{"$f":"+#REF!","v":{"$error":"#REF!"}}]

{"sheet":"Rentabilidad por Plazas","index":2,"n_rows":44,"n_cols":22,"rows_kept":44,"cut":false,"hidden":true,"merged":[[0,2,0,3],[0,5,0,6]]}
["2018-03-01",null,"Gastos Casa central",null,{"$f":"650000+87000+20000+68000+50000+33000+2700+57000+138000+28000","v":1133700},"Ventas totales del mes",null,{"$f":"SUMIFS(Tabla1[Costo Total],Tabla1[Mes de Facturacion],A1)","v":0}]
[null,"Posadas","Corrientes","Resistencia","Jujuy","Tucuman","Neuquen","Santa Rosa","Bahia Blanca","Catamarca","Santiago del Estero","La Rioja","San Juan","Salta","Cordoba","Mendoza","Rosario","Trelew","Carlos Paz","Capital Federal","Mar del Plata","Parana"]
["Ventas del Mes",{"$f":"SUMIFS(Tabla1[Costo Total],Tabla1[Localidad (con Naranja no propias)],B$2,Tabla1[Mes de Facturacion],$A$1)","v":0},{"$f":"SUMIFS(Tabla1[Costo Total],Tabla1[Localidad (con Naranja no propias)],C$2,Tabla1[Mes de Facturacion],$A$1)","v":0},{"$f":"SUMIFS(Tabla1[Costo Total],Tabla1[Localidad (con Naranja no propias)],D$2,Tabla1[Mes de Facturacion],$A$1)","v":0},{"$f":"SUMIFS(Tabla1[Costo Total],Tabla1[Localidad (con Naranja no propias)],E$2,Tabla1[Mes de Facturacion],$A$1)","v":0},{"$f":"SUMIFS(Tabla1[Costo Total],Tabla1[Localidad (con Naranja no propias)],F$2,Tabla1[Mes de Facturacion],$A$1)","v":0},{"$f":"SUMIFS(Tabla1[Costo Total],Tabla1[Localidad (con Naranja no propias)],G$2,Tabla1[Mes de Facturacion],$A$1)","v":0},{"$f":"SUMIFS(Tabla1[Costo Total],Tabla1[Localidad (con Naranja no propias)],H$2,Tabla1[Mes de Facturacion],$A$1)","v":0},{"$f":"SUMIFS(Tabla1[Costo Total],Tabla1[Localidad (con Naranja no propias)],I$2,Tabla1[Mes de Facturacion],$A$1)","v":0},{"$f":"SUMIFS(Tabla1[Costo Total],Tabla1[Localidad (con Naranja no propias)],J$2,Tabla1[Mes de Facturacion],$A$1)","v":0},{"$f":"SUMIFS(Tabla1[Costo Total],Tabla1[Localidad (con Naranja no propias)],K$2,Tabla1[Mes de Facturacion],$A$1)","v":0},{"$f":"SUMIFS(Tabla1[Costo Total],Tabla1[Localidad (con Naranja no propias)],L$2,Tabla1[Mes de Facturacion],$A$1)","v":0},{"$f":"SUMIFS(Tabla1[Costo Total],Tabla1[Localidad (con Naranja no propias)],M$2,Tabla1[Mes de Facturacion],$A$1)","v":0},{"$f":"SUMIFS(Tabla1[Costo Total],Tabla1[Localidad (con Naranja no propias)],N$2,Tabla1[Mes de Facturacion],$A$1)","v":0},{"$f":"SUMIFS(Tabla1[Costo Total],Tabla1[Localidad (con Naranja no propias)],O$2,Tabla1[Mes de Facturacion],$A$1)","v":0},{"$f":"SUMIFS(Tabla1[Costo Total],Tabla1[Localidad (con Naranja no propias)],P$2,Tabla1[Mes de Facturacion],$A$1)","v":0},{"$f":"SUMIFS(Tabla1[Costo Total],Tabla1[Localidad (con Naranja no propias)],Q$2,Tabla1[Mes de Facturacion],$A$1)","v":0},{"$f":"SUMIFS(Tabla1[Costo Total],Tabla1[Localidad (con Naranja no propias)],R$2,Tabla1[Mes de Facturacion],$A$1)","v":0},{"$f":"SUMIFS(Tabla1[Costo Total],Tabla1[Localidad (con Naranja no propias)],S$2,Tabla1[Mes de Facturacion],$A$1)","v":0},{"$f":"SUMIFS(Tabla1[Costo Total],Tabla1[Localidad (con Naranja no propias)],T$2,Tabla1[Mes de Facturacion],$A$1)","v":0},{"$f":"SUMIFS(Tabla1[Costo Total],Tabla1[Localidad (con Naranja no propias)],U$2,Tabla1[Mes de Facturacion],$A$1)","v":0},{"$f":"SUMIFS(Tabla1[Costo Total],Tabla1[Localidad (con Naranja no propias)],V$2,Tabla1[Mes de Facturacion],$A$1)","v":0}]
["% en ventas sobre facturacion total",{"$f":"+B3/$H$1","v":{"$error":"#DIV/0!"}},{"$f":"+C3/$H$1","v":{"$error":"#DIV/0!"}},{"$f":"+D3/$H$1","v":{"$error":"#DIV/0!"}},{"$error":"#DIV/0!"},{"$error":"#DIV/0!"},{"$error":"#DIV/0!"},{"$error":"#DIV/0!"},{"$error":"#DIV/0!"},{"$error":"#DIV/0!"},{"$error":"#DIV/0!"},{"$error":"#DIV/0!"},{"$error":"#DIV/0!"},{"$f":"+N3/$H$1","v":{"$error":"#DIV/0!"}},{"$error":"#DIV/0!"},{"$error":"#DIV/0!"},{"$error":"#DIV/0!"},{"$error":"#DIV/0!"},{"$f":"+S3/$H$1","v":{"$error":"#DIV/0!"}},{"$error":"#DIV/0!"},{"$error":"#DIV/0!"},{"$f":"+V3/$H$1","v":{"$error":"#DIV/0!"}}]
["Compra de Espacios",{"$f":"SUMIFS(Tabla1[Importe de Compra],Tabla1[Localidad (con Naranja no propias)],B2,Tabla1[Mes de Facturacion],$A$1)","v":0},{"$f":"SUMIFS(Tabla1[Importe de Compra],Tabla1[Localidad (con Naranja no propias)],C2,Tabla1[Mes de Facturacion],$A$1)","v":0},{"$f":"SUMIFS(Tabla1[Importe de Compra],Tabla1[Localidad (con Naranja no propias)],D2,Tabla1[Mes de Facturacion],$A$1)","v":0},{"$f":"SUMIFS(Tabla1[Importe de Compra],Tabla1[Localidad (con Naranja no propias)],E2,Tabla1[Mes de Facturacion],$A$1)","v":0},{"$f":"SUMIFS(Tabla1[Importe de Compra],Tabla1[Localidad (con Naranja no propias)],F2,Tabla1[Mes de Facturacion],$A$1)-SUMIFS(Tabla1[Importe de Compra],Tabla1[Localidad (con Naranja no propias)],F2,Tabla1[Mes de Facturacion],$A$1,Tabla1[Empresa Fijadora],\"victor monterzino\")","v":0},{"$f":"SUMIFS(Tabla1[Importe de Compra],Tabla1[Localidad (con Naranja no propias)],G2,Tabla1[Mes de Facturacion],$A$1)","v":0},{"$f":"SUMIFS(Tabla1[Importe de Compra],Tabla1[Localidad (con Naranja no propias)],H2,Tabla1[Mes de Facturacion],$A$1)","v":0},{"$f":"SUMIFS(Tabla1[Importe de Compra],Tabla1[Localidad (con Naranja no propias)],I2,Tabla1[Mes de Facturacion],$A$1)","v":0},{"$f":"SUMIFS(Tabla1[Importe de Compra],Tabla1[Localidad (con Naranja no propias)],J2,Tabla1[Mes de Facturacion],$A$1)","v":0},{"$f":"SUMIFS(Tabla1[Importe de Compra],Tabla1[Localidad (con Naranja no propias)],K2,Tabla1[Mes de Facturacion],$A$1)","v":0},{"$f":"SUMIFS(Tabla1[Importe de Compra],Tabla1[Localidad (con Naranja no propias)],L2,Tabla1[Mes de Facturacion],$A$1)","v":0},{"$f":"SUMIFS(Tabla1[Importe de Compra],Tabla1[Localidad (con Naranja no propias)],M2,Tabla1[Mes de Facturacion],$A$1)","v":0},{"$f":"SUMIFS(Tabla1[Importe de Compra],Tabla1[Localidad (con Naranja no propias)],N2,Tabla1[Mes de Facturacion],$A$1)","v":0},{"$f":"SUMIFS(Tabla1[Importe de Compra],Tabla1[Localidad (con Naranja no propias)],O2,Tabla1[Mes de Facturacion],$A$1)","v":0},{"$f":"SUMIFS(Tabla1[Importe de Compra],Tabla1[Localidad (con Naranja no propias)],P2,Tabla1[Mes de Facturacion],$A$1)","v":0},{"$f":"SUMIFS(Tabla1[Importe de Compra],Tabla1[Localidad (con Naranja no propias)],Q2,Tabla1[Mes de Facturacion],$A$1)","v":0},{"$f":"SUMIFS(Tabla1[Importe de Compra],Tabla1[Localidad (con Naranja no propias)],R2,Tabla1[Mes de Facturacion],$A$1)","v":0},{"$f":"SUMIFS(Tabla1[Importe de Compra],Tabla1[Localidad (con Naranja no propias)],S2,Tabla1[Mes de Facturacion],$A$1)","v":0},{"$f":"SUMIFS(Tabla1[Importe de Compra],Tabla1[Localidad (con Naranja no propias)],T2,Tabla1[Mes de Facturacion],$A$1)","v":0},{"$f":"SUMIFS(Tabla1[Importe de Compra],Tabla1[Localidad (con Naranja no propias)],U2,Tabla1[Mes de Facturacion],$A$1)","v":0},{"$f":"SUMIFS(Tabla1[Importe de Compra],Tabla1[Localidad (con Naranja no propias)],V2,Tabla1[Mes de Facturacion],$A$1)","v":0}]
["Gastos Fijos Suc.",29200,{"$f":"5500+12400","v":17900},17900,16000,15000,28000,8900,31900]
["% de Gastos de CC",{"$f":"+$E$1*B4","v":{"$error":"#DIV/0!"}},{"$f":"+$E$1*C4","v":{"$error":"#DIV/0!"}},{"$error":"#DIV/0!"},{"$error":"#DIV/0!"},{"$error":"#DIV/0!"},{"$error":"#DIV/0!"},{"$error":"#DIV/0!"},{"$error":"#DIV/0!"},{"$error":"#DIV/0!"},{"$error":"#DIV/0!"},{"$error":"#DIV/0!"},{"$error":"#DIV/0!"},{"$f":"+$E$1*N4","v":{"$error":"#DIV/0!"}},{"$error":"#DIV/0!"},{"$error":"#DIV/0!"},{"$error":"#DIV/0!"},{"$error":"#DIV/0!"},{"$f":"+$E$1*S4","v":{"$error":"#DIV/0!"}},{"$error":"#DIV/0!"},{"$error":"#DIV/0!"},{"$f":"+$E$1*V4","v":{"$error":"#DIV/0!"}}]
["Neto",{"$f":"+B3-B5-B6-B7","v":{"$error":"#DIV/0!"}},{"$f":"+C3-C5-C6-C7","v":{"$error":"#DIV/0!"}},{"$error":"#DIV/0!"},{"$error":"#DIV/0!"},{"$error":"#DIV/0!"},{"$error":"#DIV/0!"},{"$error":"#DIV/0!"},{"$error":"#DIV/0!"},{"$error":"#DIV/0!"},{"$error":"#DIV/0!"},{"$error":"#DIV/0!"},{"$error":"#DIV/0!"},{"$f":"+N3-N5-N6-N7","v":{"$error":"#DIV/0!"}},{"$error":"#DIV/0!"},{"$error":"#DIV/0!"},{"$error":"#DIV/0!"},{"$error":"#DIV/0!"},{"$f":"+S3-S5-S6-S7","v":{"$error":"#DIV/0!"}},{"$error":"#DIV/0!"},{"$error":"#DIV/0!"},{"$f":"+V3-V5-V6-V7","v":{"$error":"#DIV/0!"}}]
["Rentabilidad",{"$f":"+B8/$H$1","v":{"$error":"#DIV/0!"}},{"$f":"+C8/$H$1","v":{"$error":"#DIV/0!"}},{"$error":"#DIV/0!"},{"$error":"#DIV/0!"},{"$error":"#DIV/0!"},{"$error":"#DIV/0!"},{"$error":"#DIV/0!"},{"$error":"#DIV/0!"},{"$error":"#DIV/0!"},{"$error":"#DIV/0!"},{"$error":"#DIV/0!"},{"$error":"#DIV/0!"},{"$error":"#DIV/0!"},{"$error":"#DIV/0!"},{"$error":"#DIV/0!"},{"$error":"#DIV/0!"},{"$error":"#DIV/0!"},{"$error":"#DIV/0!"},{"$error":"#DIV/0!"},{"$error":"#DIV/0!"},{"$error":"#DIV/0!"}]
[]
[]
[]
[]
[]
[]
[]
[]
[]
[]
[]
[]
[]
[]
[]
[]
[]
[]
[]
[]
[]
[]
[]
[null,"2018-01-01"]
[null,"2018-02-01"]
[null,"2018-03-01"]
[null,"2018-04-01"]
[null,"2018-05-01"]
[null,"2018-06-01"]
[null,"2018-07-01"]
[null,"2018-08-01"]
[null,"2018-09-01"]
[null,"2018-10-01"]
[null,"2018-11-01"]
[null,"2018-12-01"]

{"sheet":"Tabla cant Elementos","index":3,"n_rows":14,"n_cols":5,"rows_kept":14,"cut":false,"hidden":true,"merged":[]}
[null,"Sextuples","Carteleras","Hiperformatos","Espectaculares"]
[{"$f":"IF([1]Tablas!A2=\"\",\"\",[1]Tablas!A2)","v":"Posadas"},32,132,1]
[{"$f":"IF([1]Tablas!A3=\"\",\"\",[1]Tablas!A3)","v":"Corrientes"},65,166,6,1]
[{"$f":"IF([1]Tablas!A4=\"\",\"\",[1]Tablas!A4)","v":"Resistencia"},44,150,4,1]
[{"$f":"IF([1]Tablas!A5=\"\",\"\",[1]Tablas!A5)","v":"Jujuy"},62,188,1]
[{"$f":"IF([1]Tablas!A6=\"\",\"\",[1]Tablas!A6)","v":"Salta"},89,308,5]
[{"$f":"IF([1]Tablas!A7=\"\",\"\",[1]Tablas!A7)","v":"Tucuman"},122,261,4]
[{"$f":"IF([1]Tablas!A8=\"\",\"\",[1]Tablas!A8)","v":"Santiago del Estero"},163,776,7,3]
[{"$f":"IF([1]Tablas!A9=\"\",\"\",[1]Tablas!A9)","v":"Catamarca"},42,100,2]
[{"$f":"IF([1]Tablas!A10=\"\",\"\",[1]Tablas!A10)","v":"San Juan"},69,184,2]
[{"$f":"IF([1]Tablas!A11=\"\",\"\",[1]Tablas!A11)","v":"La Rioja"},65,270,7]
[{"$f":"IF([1]Tablas!A12=\"\",\"\",[1]Tablas!A12)","v":"Neuquen"},67,312,5]
[{"$f":"IF([1]Tablas!A13=\"\",\"\",[1]Tablas!A13)","v":"Santa Rosa"},78,214,4]
["bahia Blanca",176,671,3]

{"sheet":"Detalle Ingreso-Egreso","index":4,"n_rows":24,"n_cols":13,"rows_kept":24,"cut":false,"hidden":true,"merged":[]}
["Gastos-Fijos","2018-01-01","2018-02-01","2018-03-01","2018-04-01","2018-05-01","2018-06-01","2018-07-01","2018-08-01","2018-09-01","2018-10-01","2018-11-01","2018-12-01"]
["Sueldos",330000,330000,330000,330000,510000,650000,510000,510000,510000,510000,510000,650000]
["Cargas Sociales",{"$f":"+B2*40%","v":132000},{"$f":"+C2*40%","v":132000},132000,132000,204000,260000,204000,204000,204000,204000,204000,260000]
["Obra Social",13000,13000,13000,13000,13000,{"$f":"+G2*3%","v":19500},15300,15300,15300,15300,15300,19500]
["Comisiones Terceros",15000,15000,15000,15000,15000,15000,15000,15000,15000,15000,15000,15000]
["Ocupacion",70000,70000,70000,70000,70000,70000,50000,50000,50000,50000,50000,50000]
["Expensas",14000,14000,14000,14000,14000,14000,14000,14000,14000,14000,14000,14000]
["Muros",17000,17000,17000,17000,17000,17000,17000,17000,17000,17000,17000,17000]
["Servicios",6500,6500,6500,6500,6500,6500,6500,6500,6500,6500,6500,6500]
["Otros",5000,5000,5000,5000,5000,5000,5000,5000,5000,5000,5000,5000]
["Serv. Indirectos",65000,65000,65000,65000,65000,65000,65000,65000,65000,65000,65000,65000]
["Fondos Fijos",160000,160000,160000,160000,160000,160000,160000,160000,160000,160000,160000,160000]
["Material de Consumo",2500,2500,2500,2500,2500,2500,2500,2500,2500,2500,2500,2500]
["Impuestos y Tasas",80000,80000,80000,80000,80000,80000,192500,192500,192500,192500,192500,192500]
["Gastos Bancarios",27500,27500,27500,27500,27500,27500,27500,27500,27500,27500,27500,27500]
["Inversiones",57000,57000,57000,57000,57000,57000,57000,57000,57000,57000,57000,57000]
["xxxxxxxxxxxxxxxxxx"]
["Comision Agencia",{"$f":"+#REF!*0.09","v":{"$error":"#REF!"}},{"$f":"+#REF!*0.09","v":{"$error":"#REF!"}},{"$f":"+#REF!*0.09","v":{"$error":"#REF!"}},{"$f":"+#REF!*0.09","v":{"$error":"#REF!"}},{"$f":"+#REF!*0.09","v":{"$error":"#REF!"}},{"$f":"+#REF!*0.09","v":{"$error":"#REF!"}},{"$f":"+#REF!*0.09","v":{"$error":"#REF!"}},{"$f":"+#REF!*0.09","v":{"$error":"#REF!"}},{"$f":"+#REF!*0.09","v":{"$error":"#REF!"}},{"$f":"+#REF!*0.09","v":{"$error":"#REF!"}},{"$f":"+#REF!*0.09","v":{"$error":"#REF!"}},{"$f":"+#REF!*0.09","v":{"$error":"#REF!"}}]
["Sub Total Fijos",{"$f":"SUM(B2:B18)","v":{"$error":"#REF!"}},{"$error":"#REF!"},{"$error":"#REF!"},{"$error":"#REF!"},{"$error":"#REF!"},{"$error":"#REF!"},{"$error":"#REF!"},{"$error":"#REF!"},{"$error":"#REF!"},{"$error":"#REF!"},{"$error":"#REF!"},{"$error":"#REF!"}]
["Gastos Variables"]
["Imprenta",{"$f":"SUMIFS(Tabla1[Importe de Compra],Tabla1[Mes de Facturacion],B1,Tabla1[Tipo de Elemento],\"produccion\")","v":0},{"$f":"SUMIFS(Tabla1[Cantidad Comprada],Tabla1[Empresa Fijadora],C1,Tabla1[Cantidad vendida],\"produccion\")","v":0},{"$f":"SUMIFS(Tabla1[Ejecutivo de Venta],Tabla1[Importe de Compra],D1,Tabla1[Cantidad a Fijar],\"produccion\")","v":0},{"$f":"SUMIFS(Tabla1[Empresa que vendio],Tabla1[Cantidad Comprada],E1,Tabla1[Robada],\"produccion\")","v":0},{"$f":"SUMIFS(Tabla1[H. Ruta],Tabla1[Ejecutivo de Venta],F1,Tabla1[Costo Unitario],\"produccion\")","v":0},{"$f":"SUMIFS(Tabla1[Envio List],Tabla1[Empresa que vendio],G1,Tabla1[Costo Total],\"produccion\")","v":0},{"$f":"SUMIFS(Tabla1[Pauta (con rojo tiene Listado)],Tabla1[H. Ruta],H1,Tabla1[Fecha de Inicio],\"produccion\")","v":0},{"$f":"SUMIFS(Tabla1[Cliente (con rojo Tiene Hoja de Ruta)],Tabla1[Envio List],I1,Tabla1[Fecha Finalizacion],\"produccion\")","v":0},{"$f":"SUMIFS(Tabla1[Telco],Tabla1[Pauta (con rojo tiene Listado)],J1,Tabla1[Cantidad de Dias],\"produccion\")","v":0},{"$f":"SUMIFS(Tabla1[Localidad (con Naranja no propias)],Tabla1[Cliente (con rojo Tiene Hoja de Ruta)],K1,Tabla1[Mes de Facturacion],\"produccion\")","v":0},{"$f":"SUMIFS(Tabla1[Tipo de Elemento],Tabla1[Telco],L1,Tabla1[Empresa Fijadora],\"produccion\")","v":0},{"$f":"SUMIFS(Tabla1[Cantidad vendida],Tabla1[Localidad (con Naranja no propias)],M1,Tabla1[Importe de Compra],\"produccion\")","v":0}]
["Compra de Espacios",{"$f":"SUMIFS(Tabla1[Importe de Compra],Tabla1[Mes de Facturacion],B1,Tabla1[Empresa que vendio],\"soporte\")-B21","v":0},{"$f":"SUMIFS(Tabla1[Importe de Compra],Tabla1[Mes de Facturacion],C1,Tabla1[Empresa que vendio],\"soporte\")-C21","v":0},{"$f":"SUMIFS(Tabla1[Importe de Compra],Tabla1[Mes de Facturacion],D1,Tabla1[Empresa que vendio],\"soporte\")-D21","v":0},{"$f":"SUMIFS(Tabla1[Importe de Compra],Tabla1[Mes de Facturacion],E1,Tabla1[Empresa que vendio],\"soporte\")-E21","v":0},{"$f":"SUMIFS(Tabla1[Importe de Compra],Tabla1[Mes de Facturacion],F1,Tabla1[Empresa que vendio],\"soporte\")-F21","v":0},{"$f":"SUMIFS(Tabla1[Importe de Compra],Tabla1[Mes de Facturacion],G1,Tabla1[Empresa que vendio],\"soporte\")-G21","v":0},{"$f":"SUMIFS(Tabla1[Importe de Compra],Tabla1[Mes de Facturacion],H1,Tabla1[Empresa que vendio],\"soporte\")-H21","v":0},{"$f":"SUMIFS(Tabla1[Importe de Compra],Tabla1[Mes de Facturacion],I1,Tabla1[Empresa que vendio],\"soporte\")-I21","v":0},{"$f":"SUMIFS(Tabla1[Importe de Compra],Tabla1[Mes de Facturacion],J1,Tabla1[Empresa que vendio],\"soporte\")-J21","v":0},{"$f":"SUMIFS(Tabla1[Importe de Compra],Tabla1[Mes de Facturacion],K1,Tabla1[Empresa que vendio],\"soporte\")-K21","v":0},{"$f":"SUMIFS(Tabla1[Importe de Compra],Tabla1[Mes de Facturacion],L1,Tabla1[Empresa que vendio],\"soporte\")-L21","v":0},{"$f":"SUMIFS(Tabla1[Importe de Compra],Tabla1[Mes de Facturacion],M1,Tabla1[Empresa que vendio],\"soporte\")-M21","v":0}]
["Sub Total Variables",{"$f":"SUM(B21:B22)","v":0},{"$f":"SUM(C21:C22)","v":0},0,0,0,0,0,0,0,0,0,0]
["Total General",{"$f":"+B23+B19","v":{"$error":"#REF!"}},{"$f":"+C23+C19","v":{"$error":"#REF!"}},{"$error":"#REF!"},{"$error":"#REF!"},{"$error":"#REF!"},{"$error":"#REF!"},{"$error":"#REF!"},{"$error":"#REF!"},{"$error":"#REF!"},{"$error":"#REF!"},{"$error":"#REF!"},{"$error":"#REF!"}]

{"sheet":"Tablas","index":5,"n_rows":15,"n_cols":6,"rows_kept":15,"cut":false,"hidden":false,"merged":[]}
["Localidades","Sextuples","Carteleras","Hiperformatos","Espectaculares","Telco"]
[{"$f":"IF([2]Tablas!A2=\"\",\"\",[2]Tablas!A2)","v":"Posadas"},31,172,1,null,22]
[{"$f":"IF([2]Tablas!A3=\"\",\"\",[2]Tablas!A3)","v":"Corrientes"},70,116,2,null,46]
[{"$f":"IF([2]Tablas!A4=\"\",\"\",[2]Tablas!A4)","v":"Resistencia"},41,150,0,null,30]
[{"$f":"IF([2]Tablas!A5=\"\",\"\",[2]Tablas!A5)","v":"Jujuy"},68,188,1,null,49]
[{"$f":"IF([2]Tablas!A6=\"\",\"\",[2]Tablas!A6)","v":"Salta"},89,309,5,null,52]
[{"$f":"IF([2]Tablas!A7=\"\",\"\",[2]Tablas!A7)","v":"Tucuman"},122,222,4,null,80]
["Santiago del Estero",159,704,8,null,106]
[{"$f":"IF([2]Tablas!A9=\"\",\"\",[2]Tablas!A9)","v":"Catamarca"},42,100,3,null,30]
[{"$f":"IF([2]Tablas!A10=\"\",\"\",[2]Tablas!A10)","v":"San Juan"},56,147,2,null,35]
[{"$f":"IF([2]Tablas!A11=\"\",\"\",[2]Tablas!A11)","v":"La Rioja"},67,282,7,null,45]
[{"$f":"IF([2]Tablas!A12=\"\",\"\",[2]Tablas!A12)","v":"Neuquen"},67,312,2,null,41]
[{"$f":"IF([2]Tablas!A13=\"\",\"\",[2]Tablas!A13)","v":"Santa Rosa"},78,214,4,null,47]
[{"$f":"IF([2]Tablas!A14=\"\",\"\",[2]Tablas!A14)","v":"Bahia Blanca"},176,671,2,null,107]
["General Roca"]