{"text_format":"1","workbook":"xlsx","n_sheets":2,"sheets":["MNA Datagrid collect","MNA Datagrid view"],"not_rendered":{"charts":0,"images":0,"macros":1,"external_links":0,"defined_names":17,"comments":0,"pivot_tables":0},"unopened":[],"bounds":{"document_bytes":16777216,"sheet_cells":100000,"rows_first":2000,"rows_last":500,"rows_between":2000,"halvings":0,"cell_chars":16384,"cell_head_chars":4096},"cells_cut":0,"cells_raw":0,"read":"whole","date_system":"1900"}

{"sheet":"MNA Datagrid collect","index":0,"n_rows":168,"n_cols":29,"rows_kept":168,"cut":false,"hidden":false,"merged":[[2,27,2,28]]}
[null,null,null,{"$f":"\"MS000MNA\"","v":"MS000MNA"},{"$f":"VLOOKUP(DataColl[[#This Row],[DBA]],#REF!,2,FALSE)","v":{"$error":"#VALUE!"}},null,null,null,null,{"$f":"IF(DataColl[[#This Row],[Period]]<>\"\",DATE(LEFT(DataColl[[#This Row],[Period]],4),MID(DataColl[[#This Row],[Period]],5,2),1),\"\")","v":{"$error":"#VALUE!"}},{"$f":"(DataColl[[#This Row],[MID]]*100000)+DataColl[[#This Row],[Period_]]","v":{"$error":"#VALUE!"}},null,{"$f":"IF(DataColl[[#This Row],[Net\nVolume]]<1,0,\"Operated\")","v":{"$error":"#VALUE!"}},null,null,null,null,null,null,null,{"$f":"IF(DataColl[[#This Row],[Error]]<>\"X\",((DataColl[[#This Row],[GrossRev]]-DataColl[[#This Row],[DiscExp]])*VALUE(MID(DataColl[[#Headers],[MNA20%]],4,3)))+(DataColl[[#This Row],[GrossRev]]*0.05),0)","v":{"$error":"#VALUE!"}},null,null,null,{"$f":"SUM(DataColl[[#This Row],[DiscExp]:[Tot\nMiscExp]])","v":{"$error":"#VALUE!"}},{"$f":"DataColl[[#This Row],[GrossRev]]-DataColl[[#This Row],[GrossExp]]","v":{"$error":"#VALUE!"}}]
[null,null,null,null,null,null,null,null,null,null,null,null,null,null,null,null,null,null,null,null,null,null,null,null,null,null,null,"I","X"]
[null,null,null,null,null,null,null,null,null,null,null,null,null,null,null,null,null,null,null,null,null,null,null,null,null,null,null,"($ en miles)"]
[]
[null,null,"ConsD","Partner","Vendor","DBA","Portfolio","MID","Period","Period_","MID+Per","Net\nVolume","Net\nVolume 0","NetNo","Tot\nDiscIncome","Tot\nAuthRev","Tot\nProcRev","Tot\nMiscRev","GrossRev","DiscExp","MNA20%","Tot\nAuthExp","Tot\nProcExp","Tot\nMiscExp","GrossExp","TotResidual\nEarnings","TotResEarn_Err","Inactive","Error"]
[null,null,{"$f":"IF(C5=\"ConsD\",1,C5+1)","v":1},{"$f":"\"MS000MNA\"","v":"MS000MNA"},"MNA01","CACTUS COMIDA MEXICANA 1","MS000MNAA1","8031689469","201709 SEP",{"$f":"IF(DataColl[[#This Row],[Period]]<>\"\",DATE(LEFT(DataColl[[#This Row],[Period]],4),MID(DataColl[[#This Row],[Period]],5,2),1),\"\")","v":"2017-09-01"},{"$f":"(DataColl[[#This Row],[MID]]*100000)+DataColl[[#This Row],[Period_]]","v":803168946942979},26048.97,{"$f":"IF(DataColl[[#This Row],[Net\nVolume]]<1,0,\"Operado\")","v":"Operado"},1900,908.77,201.06,0,89.98,1199.81,615.17999999999995,{"$f":"IF(DataColl[[#This Row],[Error]]<>\"X\",((DataColl[[#This Row],[GrossRev]]-DataColl[[#This Row],[DiscExp]])*VALUE(MID(DataColl[[#Headers],[MNA20%]],4,3)))+(DataColl[[#This Row],[GrossRev]]*0.05),0)","v":176.91649999999998},90.21,35.840000000000003,15,{"$f":"SUM(DataColl[[#This Row],[DiscExp]:[Tot\nMiscExp]])","v":933.14649999999995},{"$f":"DataColl[[#This Row],[GrossRev]]-DataColl[[#This Row],[GrossExp]]","v":266.6635},{"$f":"IF(DataColl[[#This Row],[Error]]=\"X\",DataColl[[#This Row],[TotResidual\nEarnings]],0)","v":0}]
[null,null,2,"MS000MNA","MNA01","SOLUCIONES ADMINISTRATIVAS","MS000MNAA1","8031694931","201709 SEP",{"$f":"IF(DataColl[[#This Row],[Period]]<>\"\",DATE(LEFT(DataColl[[#This Row],[Period]],4),MID(DataColl[[#This Row],[Period]],5,2),1),\"\")","v":"2017-09-01"},{"$f":"(DataColl[[#This Row],[MID]]*100000)+DataColl[[#This Row],[Period_]]","v":803169493142979},0,{"$f":"IF(DataColl[[#This Row],[Net\nVolume]]<1,0,\"Operado\")","v":0},0,0,0,0,0,0,0,{"$f":"IF(DataColl[[#This Row],[Error]]<>\"X\",((DataColl[[#This Row],[GrossRev]]-DataColl[[#This Row],[DiscExp]])*VALUE(MID(DataColl[[#Headers],[MNA20%]],4,3)))+(DataColl[[#This Row],[GrossRev]]*0.05),0)","v":0},0,0,0,{"$f":"SUM(DataColl[[#This Row],[DiscExp]:[Tot\nMiscExp]])","v":0},{"$f":"DataColl[[#This Row],[GrossRev]]-DataColl[[#This Row],[GrossExp]]","v":0},{"$f":"IF(DataColl[[#This Row],[Error]]=\"X\",DataColl[[#This Row],[TotResidual\nEarnings]],0)","v":0}]
[null,null,3,"MS000MNA","MNA01","CACTUS TAQUERIA 4","MS000MNAA1","8031700076","201709 SEP",{"$f":"IF(DataColl[[#This Row],[Period]]<>\"\",DATE(LEFT(DataColl[[#This Row],[Period]],4),MID(DataColl[[#This Row],[Period]],5,2),1),\"\")","v":"2017-09-01"},{"$f":"(DataColl[[#This Row],[MID]]*100000)+DataColl[[#This Row],[Period_]]","v":803170007642979},0,{"$f":"IF(DataColl[[#This Row],[Net\nVolume]]<1,0,\"Operado\")","v":0},0,15,0,0,34.979999999999997,49.98,7.5,{"$f":"IF(DataColl[[#This Row],[Error]]<>\"X\",((DataColl[[#This Row],[GrossRev]]-DataColl[[#This Row],[DiscExp]])*VALUE(MID(DataColl[[#Headers],[MNA20%]],4,3)))+(DataColl[[#This Row],[GrossRev]]*0.05),0)","v":10.995000000000001},0,0,15,{"$f":"SUM(DataColl[[#This Row],[DiscExp]:[Tot\nMiscExp]])","v":33.495000000000005},{"$f":"DataColl[[#This Row],[GrossRev]]-DataColl[[#This Row],[GrossExp]]","v":16.484999999999992},{"$f":"IF(DataColl[[#This Row],[Error]]=\"X\",DataColl[[#This Row],[TotResidual\nEarnings]],0)","v":0}]
[null,null,4,"MS000MNA","MNA01","CACTUS TAQUERIA 3","MS000MNAA1","8031700159","201709 SEP",{"$f":"IF(DataColl[[#This Row],[Period]]<>\"\",DATE(LEFT(DataColl[[#This Row],[Period]],4),MID(DataColl[[#This Row],[Period]],5,2),1),\"\")","v":"2017-09-01"},{"$f":"(DataColl[[#This Row],[MID]]*100000)+DataColl[[#This Row],[Period_]]","v":803170015942979},0,{"$f":"IF(DataColl[[#This Row],[Net\nVolume]]<1,0,\"Operado\")","v":0},0,15,0,0,34.979999999999997,49.98,7.5,{"$f":"IF(DataColl[[#This Row],[Error]]<>\"X\",((DataColl[[#This Row],[GrossRev]]-DataColl[[#This Row],[DiscExp]])*VALUE(MID(DataColl[[#Headers],[MNA20%]],4,3)))+(DataColl[[#This Row],[GrossRev]]*0.05),0)","v":10.995000000000001},0,0,15,{"$f":"SUM(DataColl[[#This Row],[DiscExp]:[Tot\nMiscExp]])","v":33.495000000000005},{"$f":"DataColl[[#This Row],[GrossRev]]-DataColl[[#This Row],[GrossExp]]","v":16.484999999999992},{"$f":"IF(DataColl[[#This Row],[Error]]=\"X\",DataColl[[#This Row],[TotResidual\nEarnings]],0)","v":0}]
[null,null,5,"MS000MNA","MNA02","LAS PLAYAS DE DON ARTURO","MS000MNAA1","8031751814","201709 SEP",{"$f":"IF(DataColl[[#This Row],[Period]]<>\"\",DATE(LEFT(DataColl[[#This Row],[Period]],4),MID(DataColl[[#This Row],[Period]],5,2),1),\"\")","v":"2017-09-01"},{"$f":"(DataColl[[#This Row],[MID]]*100000)+DataColl[[#This Row],[Period_]]","v":803175181442979},1241.2,{"$f":"IF(DataColl[[#This Row],[Net\nVolume]]<1,0,\"Operado\")","v":"Operado"},48,39.67,8.4,44.94,29.99,123,31.1,{"$f":"IF(DataColl[[#This Row],[Error]]<>\"X\",((DataColl[[#This Row],[GrossRev]]-DataColl[[#This Row],[DiscExp]])*VALUE(MID(DataColl[[#Headers],[MNA20%]],4,3)))+(DataColl[[#This Row],[GrossRev]]*0.05),0)","v":24.53},1.31,27.99,593,{"$f":"SUM(DataColl[[#This Row],[DiscExp]:[Tot\nMiscExp]])","v":677.93000000000006},{"$f":"DataColl[[#This Row],[GrossRev]]-DataColl[[#This Row],[GrossExp]]","v":-554.93000000000006},{"$f":"IF(DataColl[[#This Row],[Error]]=\"X\",DataColl[[#This Row],[TotResidual\nEarnings]],0)","v":0}]
[null,null,6,"MS000MNA","MNA01","LA PEQUENA CAKE DECORACION","MS000MNAA1","8031789327","201709 SEP",{"$f":"IF(DataColl[[#This Row],[Period]]<>\"\",DATE(LEFT(DataColl[[#This Row],[Period]],4),MID(DataColl[[#This Row],[Period]],5,2),1),\"\")","v":"2017-09-01"},{"$f":"(DataColl[[#This Row],[MID]]*100000)+DataColl[[#This Row],[Period_]]","v":803178932742979},399.7,{"$f":"IF(DataColl[[#This Row],[Net\nVolume]]<1,0,\"Operado\")","v":"Operado"},20,12.36,2.2999999999999998,4.0199999999999996,19.98,38.659999999999997,8.18,{"$f":"IF(DataColl[[#This Row],[Error]]<>\"X\",((DataColl[[#This Row],[GrossRev]]-DataColl[[#This Row],[DiscExp]])*VALUE(MID(DataColl[[#Headers],[MNA20%]],4,3)))+(DataColl[[#This Row],[GrossRev]]*0.05),0)","v":8.0289999999999999},1.04,2.21,2,{"$f":"SUM(DataColl[[#This Row],[DiscExp]:[Tot\nMiscExp]])","v":21.459},{"$f":"DataColl[[#This Row],[GrossRev]]-DataColl[[#This Row],[GrossExp]]","v":17.200999999999997},{"$f":"IF(DataColl[[#This Row],[Error]]=\"X\",DataColl[[#This Row],[TotResidual\nEarnings]],0)","v":0}]
[null,null,7,"MS000MNA","MNA01","LA PEQUENA PANADERIA","MS000MNAA1","8031796280","201709 SEP",{"$f":"IF(DataColl[[#This Row],[Period]]<>\"\",DATE(LEFT(DataColl[[#This Row],[Period]],4),MID(DataColl[[#This Row],[Period]],5,2),1),\"\")","v":"2017-09-01"},{"$f":"(DataColl[[#This Row],[MID]]*100000)+DataColl[[#This Row],[Period_]]","v":803179628042979},649.46,{"$f":"IF(DataColl[[#This Row],[Net\nVolume]]<1,0,\"Operado\")","v":"Operado"},59,35.340000000000003,10.45,41.78,20.97,108.54,24.14,{"$f":"IF(DataColl[[#This Row],[Error]]<>\"X\",((DataColl[[#This Row],[GrossRev]]-DataColl[[#This Row],[DiscExp]])*VALUE(MID(DataColl[[#Headers],[MNA20%]],4,3)))+(DataColl[[#This Row],[GrossRev]]*0.05),0)","v":22.307000000000002},2.41,24,7,{"$f":"SUM(DataColl[[#This Row],[DiscExp]:[Tot\nMiscExp]])","v":79.856999999999999},{"$f":"DataColl[[#This Row],[GrossRev]]-DataColl[[#This Row],[GrossExp]]","v":28.683000000000007},{"$f":"IF(DataColl[[#This Row],[Error]]=\"X\",DataColl[[#This Row],[TotResidual\nEarnings]],0)","v":0}]
[null,null,8,"MS000MNA","MNA01","PANCAKES CELESTIALES","MS000MNAA1","8031806311","201709 SEP",{"$f":"IF(DataColl[[#This Row],[Period]]<>\"\",DATE(LEFT(DataColl[[#This Row],[Period]],4),MID(DataColl[[#This Row],[Period]],5,2),1),\"\")","v":"2017-09-01"},{"$f":"(DataColl[[#This Row],[MID]]*100000)+DataColl[[#This Row],[Period_]]","v":803180631142979},2534.9299999999998,{"$f":"IF(DataColl[[#This Row],[Net\nVolume]]<1,0,\"Operado\")","v":"Operado"},80,63.34,0.5,1.22,19.98,85.04,34.35,{"$f":"IF(DataColl[[#This Row],[Error]]<>\"X\",((DataColl[[#This Row],[GrossRev]]-DataColl[[#This Row],[DiscExp]])*VALUE(MID(DataColl[[#Headers],[MNA20%]],4,3)))+(DataColl[[#This Row],[GrossRev]]*0.05),0)","v":14.390000000000002},0.14000000000000001,2.0499999999999998,2,{"$f":"SUM(DataColl[[#This Row],[DiscExp]:[Tot\nMiscExp]])","v":52.93},{"$f":"DataColl[[#This Row],[GrossRev]]-DataColl[[#This Row],[GrossExp]]","v":32.110000000000007},{"$f":"IF(DataColl[[#This Row],[Error]]=\"X\",DataColl[[#This Row],[TotResidual\nEarnings]],0)","v":0}]
[null,null,9,"MS000MNA","MNA02","HELADOS MEXTY 2","MS000MNAA1","8031806618","201709 SEP",{"$f":"IF(DataColl[[#This Row],[Period]]<>\"\",DATE(LEFT(DataColl[[#This Row],[Period]],4),MID(DataColl[[#This Row],[Period]],5,2),1),\"\")","v":"2017-09-01"},{"$f":"(DataColl[[#This Row],[MID]]*100000)+DataColl[[#This Row],[Period_]]","v":803180661842979},389.97,{"$f":"IF(DataColl[[#This Row],[Net\nVolume]]<1,0,\"Operado\")","v":"Operado"},41,14.34,2.15,5.09,0,21.58,11.15,{"$f":"IF(DataColl[[#This Row],[Error]]<>\"X\",((DataColl[[#This Row],[GrossRev]]-DataColl[[#This Row],[DiscExp]])*VALUE(MID(DataColl[[#Headers],[MNA20%]],4,3)))+(DataColl[[#This Row],[GrossRev]]*0.05),0)","v":3.165},0.81,4.97,202,{"$f":"SUM(DataColl[[#This Row],[DiscExp]:[Tot\nMiscExp]])","v":222.095},{"$f":"DataColl[[#This Row],[GrossRev]]-DataColl[[#This Row],[GrossExp]]","v":-200.51499999999999},{"$f":"IF(DataColl[[#This Row],[Error]]=\"X\",DataColl[[#This Row],[TotResidual\nEarnings]],0)","v":0}]
[null,null,10,"MS000MNA","MNA02","HELADOS MEXTY","MS000MNAA1","8031806667","201709 SEP",{"$f":"IF(DataColl[[#This Row],[Period]]<>\"\",DATE(LEFT(DataColl[[#This Row],[Period]],4),MID(DataColl[[#This Row],[Period]],5,2),1),\"\")","v":"2017-09-01"},{"$f":"(DataColl[[#This Row],[MID]]*100000)+DataColl[[#This Row],[Period_]]","v":803180666742979},52.95,{"$f":"IF(DataColl[[#This Row],[Net\nVolume]]<1,0,\"Operado\")","v":"Operado"},11,3.1,0.6,1.82,5,10.52,2.37,{"$f":"IF(DataColl[[#This Row],[Error]]<>\"X\",((DataColl[[#This Row],[GrossRev]]-DataColl[[#This Row],[DiscExp]])*VALUE(MID(DataColl[[#Headers],[MNA20%]],4,3)))+(DataColl[[#This Row],[GrossRev]]*0.05),0)","v":2.1559999999999997},0.31,1.71,361,{"$f":"SUM(DataColl[[#This Row],[DiscExp]:[Tot\nMiscExp]])","v":367.54599999999999},{"$f":"DataColl[[#This Row],[GrossRev]]-DataColl[[#This Row],[GrossExp]]","v":-357.02600000000001},{"$f":"IF(DataColl[[#This Row],[Error]]=\"X\",DataColl[[#This Row],[TotResidual\nEarnings]],0)","v":0}]
[null,null,11,"MS000MNA","MNA01","TORTAS MEXICO RESTAURANT","MS000MNAA1","8031806931","201709 SEP",{"$f":"IF(DataColl[[#This Row],[Period]]<>\"\",DATE(LEFT(DataColl[[#This Row],[Period]],4),MID(DataColl[[#This Row],[Period]],5,2),1),\"\")","v":"2017-09-01"},{"$f":"(DataColl[[#This Row],[MID]]*100000)+DataColl[[#This Row],[Period_]]","v":803180693142979},2590.38,{"$f":"IF(DataColl[[#This Row],[Net\nVolume]]<1,0,\"Operado\")","v":"Operado"},135,85.14,14.5,0,19.98,119.62,52.8,{"$f":"IF(DataColl[[#This Row],[Error]]<>\"X\",((DataColl[[#This Row],[GrossRev]]-DataColl[[#This Row],[DiscExp]])*VALUE(MID(DataColl[[#Headers],[MNA20%]],4,3)))+(DataColl[[#This Row],[GrossRev]]*0.05),0)","v":19.345000000000002},2.39,2.56,2,{"$f":"SUM(DataColl[[#This Row],[DiscExp]:[Tot\nMiscExp]])","v":79.094999999999999},{"$f":"DataColl[[#This Row],[GrossRev]]-DataColl[[#This Row],[GrossExp]]","v":40.525000000000006},{"$f":"IF(DataColl[[#This Row],[Error]]=\"X\",DataColl[[#This Row],[TotResidual\nEarnings]],0)","v":0}]
[null,null,12,"MS000MNA","MNA02","CARNITAS EL REY","MS000MNAA1","8031816237","201709 SEP",{"$f":"IF(DataColl[[#This Row],[Period]]<>\"\",DATE(LEFT(DataColl[[#This Row],[Period]],4),MID(DataColl[[#This Row],[Period]],5,2),1),\"\")","v":"2017-09-01"},{"$f":"(DataColl[[#This Row],[MID]]*100000)+DataColl[[#This Row],[Period_]]","v":803181623742979},7930.67,{"$f":"IF(DataColl[[#This Row],[Net\nVolume]]<1,0,\"Operado\")","v":"Operado"},344,181.03,25.3,0,20,226.33,131.96,{"$f":"IF(DataColl[[#This Row],[Error]]<>\"X\",((DataColl[[#This Row],[GrossRev]]-DataColl[[#This Row],[DiscExp]])*VALUE(MID(DataColl[[#Headers],[MNA20%]],4,3)))+(DataColl[[#This Row],[GrossRev]]*0.05),0)","v":30.190500000000004},2.78,6.8,0,{"$f":"SUM(DataColl[[#This Row],[DiscExp]:[Tot\nMiscExp]])","v":171.73050000000003},{"$f":"DataColl[[#This Row],[GrossRev]]-DataColl[[#This Row],[GrossExp]]","v":54.599499999999978},{"$f":"IF(DataColl[[#This Row],[Error]]=\"X\",DataColl[[#This Row],[TotResidual\nEarnings]],0)","v":0}]
[null,null,13,"MS000MNA","MNA02","CARNITAS EL REY 2","MS000MNAA1","8031816310","201709 SEP",{"$f":"IF(DataColl[[#This Row],[Period]]<>\"\",DATE(LEFT(DataColl[[#This Row],[Period]],4),MID(DataColl[[#This Row],[Period]],5,2),1),\"\")","v":"2017-09-01"},{"$f":"(DataColl[[#This Row],[MID]]*100000)+DataColl[[#This Row],[Period_]]","v":803181631042979},0,{"$f":"IF(DataColl[[#This Row],[Net\nVolume]]<1,0,\"Operado\")","v":0},0,0,0,0,0,0,0,{"$f":"IF(DataColl[[#This Row],[Error]]<>\"X\",((DataColl[[#This Row],[GrossRev]]-DataColl[[#This Row],[DiscExp]])*VALUE(MID(DataColl[[#Headers],[MNA20%]],4,3)))+(DataColl[[#This Row],[GrossRev]]*0.05),0)","v":0},0,0,0,{"$f":"SUM(DataColl[[#This Row],[DiscExp]:[Tot\nMiscExp]])","v":0},{"$f":"DataColl[[#This Row],[GrossRev]]-DataColl[[#This Row],[GrossExp]]","v":0},{"$f":"IF(DataColl[[#This Row],[Error]]=\"X\",DataColl[[#This Row],[TotResidual\nEarnings]],0)","v":0}]
[null,null,14,"MS000MNA","MNA02","ELIAS BABY FASHION","MS000MNAA1","8031816385","201709 SEP",{"$f":"IF(DataColl[[#This Row],[Period]]<>\"\",DATE(LEFT(DataColl[[#This Row],[Period]],4),MID(DataColl[[#This Row],[Period]],5,2),1),\"\")","v":"2017-09-01"},{"$f":"(DataColl[[#This Row],[MID]]*100000)+DataColl[[#This Row],[Period_]]","v":803181638542979},329.18,{"$f":"IF(DataColl[[#This Row],[Net\nVolume]]<1,0,\"Operado\")","v":"Operado"},6,4.88,0.3,0.69,30,35.869999999999997,3.15,{"$f":"IF(DataColl[[#This Row],[Error]]<>\"X\",((DataColl[[#This Row],[GrossRev]]-DataColl[[#This Row],[DiscExp]])*VALUE(MID(DataColl[[#Headers],[MNA20%]],4,3)))+(DataColl[[#This Row],[GrossRev]]*0.05),0)","v":8.3375000000000004},0.12,0.71,2,{"$f":"SUM(DataColl[[#This Row],[DiscExp]:[Tot\nMiscExp]])","v":14.317499999999999},{"$f":"DataColl[[#This Row],[GrossRev]]-DataColl[[#This Row],[GrossExp]]","v":21.552499999999998},{"$f":"IF(DataColl[[#This Row],[Error]]=\"X\",DataColl[[#This Row],[TotResidual\nEarnings]],0)","v":0}]
[null,null,15,"MS000MNA","MNA02","GELI DELISH","MS000MNAA1","8031818316","201709 SEP",{"$f":"IF(DataColl[[#This Row],[Period]]<>\"\",DATE(LEFT(DataColl[[#This Row],[Period]],4),MID(DataColl[[#This Row],[Period]],5,2),1),\"\")","v":"2017-09-01"},{"$f":"(DataColl[[#This Row],[MID]]*100000)+DataColl[[#This Row],[Period_]]","v":803181831642979},190.41,{"$f":"IF(DataColl[[#This Row],[Net\nVolume]]<1,0,\"Operado\")","v":"Operado"},13,6.16,2.8,11.42,25,45.38,4.6399999999999997,{"$f":"IF(DataColl[[#This Row],[Error]]<>\"X\",((DataColl[[#This Row],[GrossRev]]-DataColl[[#This Row],[DiscExp]])*VALUE(MID(DataColl[[#Headers],[MNA20%]],4,3)))+(DataColl[[#This Row],[GrossRev]]*0.05),0)","v":10.417000000000002},0.31,2.87,132,{"$f":"SUM(DataColl[[#This Row],[DiscExp]:[Tot\nMiscExp]])","v":150.23699999999999},{"$f":"DataColl[[#This Row],[GrossRev]]-DataColl[[#This Row],[GrossExp]]","v":-104.857},{"$f":"IF(DataColl[[#This Row],[Error]]=\"X\",DataColl[[#This Row],[TotResidual\nEarnings]],0)","v":0}]
{"$rows_left_out":149}
{"sheet":"MNA Datagrid view","index":1,"n_rows":7,"n_cols":21,"rows_kept":7,"cut":false,"hidden":false,"merged":[]}
[]
[]
[]
[]
[null,null,"Partner","DBA","Portfolio","MID","Period ","Net\nVolume","NetNo","Tot\nDiscIncome","Tot\nAuthRev","Tot\nProcRev","Tot\nMiscRev","GrossRev","DiscExp","MNA20%","Tot\nAuthExp","Tot\nProcExp","Tot\nMiscExp","GrossExp","TotResidual\nEarnings"]
[]
[null,null,"Total",null,null,null,null,{"$f":"SUBTOTAL(109,DataView[Net\nVolume])","v":0},{"$f":"SUBTOTAL(109,DataView[NetNo])","v":0},{"$f":"SUBTOTAL(109,DataView[Tot\nDiscIncome])","v":0},{"$f":"SUBTOTAL(109,DataView[Tot\nAuthRev])","v":0},{"$f":"SUBTOTAL(109,DataView[Tot\nProcRev])","v":0},{"$f":"SUBTOTAL(109,DataView[Tot\nMiscRev])","v":0},{"$f":"SUBTOTAL(109,DataView[GrossRev])","v":0},{"$f":"SUBTOTAL(109,DataView[DiscExp])","v":0},{"$f":"SUBTOTAL(109,DataView[MNA20%])","v":0},{"$f":"SUBTOTAL(109,DataView[Tot\nAuthExp])","v":0},{"$f":"SUBTOTAL(109,DataView[Tot\nProcExp])","v":0},{"$f":"SUBTOTAL(109,DataView[Tot\nMiscExp])","v":0},{"$f":"SUBTOTAL(109,DataView[GrossExp])","v":0},{"$f":"SUBTOTAL(109,DataView[TotResidual\nEarnings])","v":0}]